program: Gaussian 09
title: 000263415
version: EM64L-G09RevD.01
frameworkgroup: C1[X(C6H5N5O4)]
method: RPBEPBE
basis: SDD
operation: Freq
keyword: #pfreq=noraman
keyword: PBEPBE/SDD
title: #p freq=noraman PBEPBE/SDD
converged: NO YES NO NO
title: Mulliken charges:
elementType: O O O O N N N N N C C C C C C H H H H H
charge: -0.220308 -0.196586 -0.297556 -0.161374 -0.280074 -0.244026 -0.418535 0.020250 0.049237 0.416649 0.112133 0.245752 0.200140 -0.147830 -0.595584 0.407602 0.314815 0.256106 0.256132 0.283058
chargesum: 0.00000
title: Mulliken charges with hydrogens summed into heavy atoms:
elementType: O O O O N N N N N C C C C C C
charge: -0.220308 -0.196586 -0.297556 -0.161374 -0.280074 -0.244026 -0.010933 0.020250 0.049237 0.416649 0.112133 0.245752 0.200140 0.166985 0.199712
polarizability: 1.54150843e+02 1.04237512e+01 1.52838140e+02 3.21804920e-02 -3.15675031e-02 4.83992183e+01
1716.lowfreq: -8.4325 -3.2123 -1.2086 -0.0009 0.0001 0.0004 52.9348 78.1730 83.9299
frequency: 52.9343 78.1717 83.9265 103.0184 151.5607 194.9547 215.1827 281.9068 292.5686 330.2668 340.3634 347.0487 398.3232 410.1639 447.0268 485.4013 612.4698 613.3778 652.8070 665.8379 703.3823 709.4443 734.7800 761.7674 780.4483 823.8230 897.4415 907.7147 971.8156 989.9477 1037.2013 1130.4600 1134.0491 1160.2276 1170.2851 1212.3796 1240.9405 1270.0987 1280.5475 1311.4371 1364.8240 1398.0196 1426.8399 1471.9844 1478.9315 1486.9148 1605.6284 1649.1833 1666.9071 3016.3419 3110.8816 3146.5832 3281.6731 3537.8313
redmass: 10.7098 3.6504 1.2816 5.2691 8.8894 6.4171 9.6445 6.0258 5.5694 4.2328 11.8919 10.1824 8.0898 14.4141 6.6343 9.9298 10.1878 5.4736 13.0077 9.1789 10.2830 9.8566 5.3919 1.2482 6.8850 1.3191 5.8139 5.7580 3.3856 3.7874 5.8409 1.3066 9.1412 1.7740 3.5238 2.2444 3.9947 9.4455 3.0012 6.5716 10.6723 6.4589 1.2970 1.0810 1.0423 4.5743 10.8585 11.0862 10.3771 1.0331 1.1028 1.1018 1.1014 1.0843
irintensity: 0.3485 0.0128 0.3819 7.0761 2.9895 0.5166 3.6426 0.1637 1.4284 14.5606 2.1992 1.8805 11.6573 2.7879 17.6847 3.6698 18.0637 0.2778 1.4621 2.7860 8.6351 1.3992 7.7869 155.8137 1.9645 42.1469 59.8889 4.9763 37.6637 47.0306 26.5080 0.1010 154.0594 14.3257 4.9075 52.8226 76.8187 52.8464 111.4296 108.5116 221.2712 44.5068 135.7684 8.5452 20.7578 59.0048 25.7463 681.3055 401.2019 17.8674 12.5454 1.2717 22.0719 134.2742
temp: 298.150 k
press: 1.00000 atm
elementType: 8 8 8 8 7 7 7 7 7 6 6 6 6 6 6 1 1 1 1 1
symmnumber: 1
zpe: 338710.9 jmol-1
zpe.correction: 0.129008 hartree
zpe.thermalcorrener: 0.141339 hartree
zpe.thermalcorrenthalpy: 0.142283 hartree
zpe.thermalcorrgfe: 0.089749 hartree
zpe.sumelectzpe: -805.131732 hartree
zpe.sumelectthermal: -805.119402 hartree
zpe.sumelectthermalent: -805.118458 hartree
zpe.sumelectthermalfe: -805.170992 hartree
dipole: 4.2610 3.0320 0.0047
dipole: 5.2296
quadrupole: -102.2054 -90.1648 -82.6299
quadrupole: -9.8167 -0.0133 -0.0125
quadrupole: -10.5387 1.5019 9.0368 -9.8167 -0.0133 -0.0125
hfenergy: -805.2607404 hartree
pointgroup: C01 [X(C6H5N5O4)]
dipole: 1.8878062 0.818208 0.0032513 debye
dipolederiv: -1.2798539 -0.0377369 0.0016533 0.010339 -0.4766485 -0.0000997 -0.0032646 -0.0004705 -0.3423295 -0.5193746 -0.1969429 0.0002078 -0.2025459 -1.1007663 0.0000077 -0.0003999 -0.0028939 -0.3118158 -0.6555158 0.1486046 -0.0000498 0.3956614 -0.8075266 0.0000122 -0.0003411 0.0000238 -0.3004395 -0.8029719 -0.2637968 -0.0004181 -0.3438683 -0.5245287 -0.0001562 -0.0004878 -0.0002659 -0.1935197 -0.8994348 -0.048373 -0.0005471 0.6804133 -0.8689728 -0.0004413 0.0018473 -0.0018382 -0.0135351 -1.2083741 -0.2191103 -0.0007587 -0.2603856 -0.7416201 0.0000557 0.0016556 -0.0016524 -0.2208033 -0.1344046 0.297807 0.0003089 -0.3777506 -0.6923438 -0.0004596 0.0004064 0.0006185 -0.245211 -0.0786853 -0.0248542 0.0000515 0.2463667 -0.2646005 -0.0001152 0.0002577 -0.0003593 -0.1487503 2.0581523 0.0210889 0.0011096 -0.0774693 0.9966618 0.0000743 0.0011975 -0.0000063 0.2159209 0.7476976 0.3424266 0.0000997 0.6855676 1.0322438 0.0009437 -0.000456 -0.0001144 0.2365701 -1.2531003 0.0067158 -0.0005123 -0.1460317 -0.9588346 -0.0008313 -0.0012201 -0.000151 -0.1159051 1.8406555 -0.0149317 -0.001177 -0.2076399 1.288486 0.0004627 0.0023655 0.0020389 0.3099052 1.3527076 -0.0103201 -0.0004108 -0.0052234 1.4958 0.0004759 -0.0001643 0.0028828 0.2912305 0.0780253 0.1193982 0.0001537 -0.164706 0.5668803 0.0007324 -0.0008283 0.000462 0.0026659 0.106748 -0.0944834 0.0004753 -0.1841981 0.3258543 -0.0017024 0.0006782 -0.0005806 0.1906045 0.3059899 -0.0270616 -0.000056 -0.0796815 0.3725768 -0.0000373 0.0000268 0.0000643 0.3691802 0.1527075 0.0205891 0.0000144 0.0356615 0.1450044 -0.0001037 0.0001478 0.0000311 0.1982196 0.0354546 0.0695911 -0.0822165 0.0074742 0.0611965 -0.0343446 -0.0731299 0.0213453 -0.0306067 0.0329446 0.0693538 0.0841075 0.004979 0.0632026 0.0362159 0.073091 -0.0188945 -0.0256255 0.1206325 -0.1579642 -0.0020354 -0.0169624 0.0879353 -0.0006891 -0.0013819 -0.0002398 0.1342445 unknown
polarizability: 158.3344003|9.2552429|148.6545365|0.0746775|0.0466184|48.3992639 unknown
InChI: InChI=1S/C6H5N5O4/c1-9-5(12)3(11(14)15)4-8-7-2-10(4)6(9)13/h2,8H,1H3
charge 0 multiplicity 1
20 atoms
O  3.166569 -0.399806 0.000266
O  -0.977702 -2.646061 -0.004434
O  -2.864962 1.23932 -0.001813
O  -3.257132 -1.014546 -0.002718
N  1.181245 0.844311 -0.00055
N  1.08344 -1.512275 -0.002331
N  -0.463442 2.281371 0.001482
N  0.715563 3.05504 0.002613
N  -2.452233 -0.018256 -0.001551
C  -0.210648 0.933584 0.000298
C  -1.02459 -0.210771 -0.000737
C  1.912682 -0.396778 -0.003404
C  -0.397911 -1.535062 -0.000428
C  1.697626 2.151003 0.002031
C  1.777906 -2.824616 -0.001049
H  -1.408969 2.674486 0.001961
H  2.760513 2.36884 0.0022
H  2.403725 -2.917834 0.901434
H  2.423194 -2.908085 -0.890497
H  1.004624 -3.605264 -0.012471
