program: Gaussian 09
title: 000256671
version: EM64L-G09RevD.01
frameworkgroup: C1[X(C18H15NO2)]
method: RPBEPBE
basis: SDD
operation: Freq
keyword: #p
keyword: freq=noraman
keyword: PBEPBE/SDD
title: #p freq=noraman PBEPBE/SDD
converged: YES YES NO NO
title: Mulliken charges:
elementType: O O N C C C C C C C C C C C C C C C C C C H H H H H H H H H H H H H H H
charge: -0.206962 -0.185329 -0.348956 0.180840 0.078392 0.481294 0.364608 0.143024 -0.451042 -0.353658 -0.351121 -0.351913 -0.352847 0.449695 0.447970 -0.388413 -0.389746 -0.399756 -0.399037 -0.808496 -0.805519 0.272075 0.266719 0.265035 0.225871 0.293970 0.231832 0.231202 0.235093 0.236327 0.236977 0.225269 0.225448 0.230835 0.228629 0.241691
chargesum: 0.00000
title: Mulliken charges with hydrogens summed into heavy atoms:
elementType: O O N C C C C C C C C C C C C C C C C C C
charge: -0.206962 -0.185329 -0.348956 0.180840 0.078392 0.481294 0.364608 0.143024 -0.178967 -0.086939 -0.086086 -0.126041 -0.058876 0.449695 0.447970 -0.156581 -0.158545 -0.164663 -0.162711 -0.120803 -0.104365
polarizability: 3.86357420e+02 2.46896518e+01 2.12554535e+02 1.99790628e+00 5.83871967e+00 1.00360136e+02
1716.lowfreq: -7.2918 -2.1384 -1.0365 -0.0008 -0.0005 0.0002 18.5024 28.4242 31.0227
frequency: 18.4467 28.3109 30.9110 33.2917 48.5888 55.5248 79.8999 114.1053 155.1466 158.9467 191.3536 215.0100 274.1839 286.5111 290.9944 310.7267 348.7848 370.7324 396.6556 399.2085 406.7795 437.8083 451.9729 509.2975 534.3677 563.4246 589.4256 631.8826 635.5747 640.4362 682.1449 687.2265 715.1398 724.5474 757.7906 761.2931 791.8360 815.4483 822.7706 833.2520 835.3747 844.8122 864.1541 945.9117 956.7066 966.7401 969.1535 985.1122 988.2160 999.7332 1010.1181 1014.9721 1022.6731 1046.1771 1047.2448 1088.3529 1130.5791 1134.2441 1180.1749 1201.8174 1205.2100 1223.0486 1225.5438 1234.4526 1294.5724 1315.9639 1322.1855 1351.6472 1365.3923 1371.9949 1397.5482 1398.0562 1414.0550 1421.1878 1467.2173 1472.1889 1472.5980 1474.0126 1504.9216 1511.5724 1561.5476 1584.0056 1602.8645 1614.1247 1620.9013 1624.8775 1664.7242 2974.4793 2975.4398 3055.6318 3057.2968 3084.7156 3089.0444 3124.5193 3127.3341 3130.4617 3131.1074 3149.9443 3175.6936 3182.1138 3185.8567 3217.0081
redmass: 3.7584 1.9716 1.1157 1.3087 4.9516 4.6182 4.7650 5.2626 4.8618 6.7145 5.0590 6.0211 4.2420 6.0720 4.1821 5.9456 4.0567 3.3860 3.8194 2.8683 2.8844 4.1880 7.7977 2.6956 3.0470 5.9808 7.9019 6.7058 6.9346 5.1288 4.6999 4.4138 3.0989 3.4877 5.4357 4.4451 5.0967 2.8685 2.1149 1.2549 1.5424 1.6121 1.3926 1.3385 7.6562 1.3821 1.3548 1.4876 1.4127 1.3537 3.3894 2.7548 3.1951 1.5908 1.5597 3.9911 1.3851 1.3242 3.0477 1.2793 1.1648 2.0649 2.8746 2.0962 3.6787 1.2846 1.4164 7.7135 4.9120 6.3389 1.2207 1.2243 3.0871 3.4789 1.1091 1.1002 1.0579 1.0539 2.6274 2.7185 5.3814 6.4854 7.9031 10.5681 6.6479 6.3795 11.4521 1.0388 1.0394 1.0948 1.0939 1.0998 1.1001 1.0874 1.0903 1.0905 1.0905 1.0963 1.0950 1.0941 1.0949 1.0976
irintensity: 0.0162 1.2838 0.6599 0.5056 0.9156 0.8879 0.7326 0.5309 2.8078 3.5450 0.9179 2.8001 0.1652 2.0721 0.9113 3.8605 2.2488 1.0797 1.5793 0.0275 0.6346 4.4343 19.3951 30.5890 5.1234 8.7407 13.9730 0.4061 1.1668 11.7216 2.7001 6.3241 1.5878 1.4884 10.6084 9.6282 0.4007 19.3301 6.3216 0.0325 80.8215 39.0732 0.9736 3.2286 20.6016 0.0190 1.8860 2.1930 0.2363 2.6704 7.2472 2.2070 16.0987 29.3515 22.3954 27.9669 15.1587 18.5421 203.8273 23.4135 24.9613 8.9544 1.7715 1.1186 49.5800 3.1224 4.9842 497.7197 9.7381 0.6181 14.1129 13.7561 7.6460 4.4217 19.3751 17.0984 13.3930 12.5639 98.7509 146.9108 10.6933 40.6198 330.9526 311.8990 26.9769 5.8294 49.2404 45.1491 25.4492 22.6910 22.2220 17.6506 15.4176 11.8123 19.7816 24.8899 20.3681 15.7689 12.2273 2.8319 0.7381 7.0079
temp: 298.150 k
press: 1.00000 atm
elementType: 8 8 7 6 6 6 6 6 6 6 6 6 6 6 6 6 6 6 6 6 6 1 1 1 1 1 1 1 1 1 1 1 1 1 1 1
symmnumber: 1
zpe: 732168.9 jmol-1
zpe.correction: 0.278868 hartree
zpe.thermalcorrener: 0.297711 hartree
zpe.thermalcorrenthalpy: 0.298655 hartree
zpe.thermalcorrgfe: 0.228244 hartree
zpe.sumelectzpe: -898.684228 hartree
zpe.sumelectthermal: -898.665386 hartree
zpe.sumelectthermalent: -898.664442 hartree
zpe.sumelectthermalfe: -898.734853 hartree
dipole: -3.2299 -0.8807 0.0009
dipole: 3.3478
quadrupole: -85.1972 -123.6990 -124.9550
quadrupole: -6.7577 2.1397 4.4953
quadrupole: 26.0866 -12.4153 -13.6713 -6.7577 2.1397 4.4953
hfenergy: -898.9630966 hartree
pointgroup: C01 [X(C18H15N1O2)]
dipole: 1.2711751 0.3445274 -0.0158367 debye
polarizability: 386.4262361|24.3629551|211.5561397|-2.8091305|-11.7310188|101.2897157 unknown
InChI: InChI=1S/C18H15NO2/c1-12-3-7-14(8-4-12)16-11-17(20)19(18(16)21)15-9-5-13(2)6-10-15/h3-11H,1-2H3
charge 0 multiplicity 1
36 atoms
O  0.006092 1.546029 0.082107
O  -1.491705 -2.913856 -0.130499
N  -1.131937 -0.541119 -0.01737
C  1.241425 -0.635921 -0.007825
C  0.022615 0.290764 0.024836
C  -2.49559 -0.080716 -0.002022
C  2.635188 -0.179397 0.023933
C  -0.721444 -1.923595 -0.076936
C  0.760323 -1.922096 -0.068947
C  -3.482917 -0.82033 0.693826
C  -2.856845 1.109701 -0.678814
C  3.698668 -1.131312 -0.003658
C  2.978841 1.203702 0.086436
C  -5.202288 0.821271 0.032236
C  5.385012 0.659858 0.084182
C  -4.818615 -0.369617 0.699968
C  -4.19524 1.551932 -0.648318
C  5.04053 -0.719391 0.027162
C  4.328104 1.605806 0.116949
C  -6.648317 1.284729 0.025366
C  6.835195 1.102267 0.087293
H  1.316061 -2.85788 -0.11168
H  -3.211957 -1.74236 1.213213
H  -2.098229 1.692862 -1.205603
H  3.472256 -2.202381 -0.045192
H  2.17961 1.948694 0.115972
H  -5.574701 -0.952477 1.239406
H  -4.461124 2.480323 -1.167822
H  5.838166 -1.471579 0.008625
H  4.566489 2.674772 0.169142
H  -7.199195 0.855478 -0.834376
H  -7.178493 0.971996 0.942234
H  -6.721964 2.383652 -0.054269
H  6.966148 2.059354 0.621474
H  7.489425 0.349765 0.561328
H  7.203515 1.251274 -0.946855
