program: Gaussian 09
title: 000263413
version: EM64L-G09RevD.01
frameworkgroup: C1[X(C10H14N4S)]
method: RPBEPBE
basis: SDD
operation: Freq
keyword: #p
keyword: freq=noraman
keyword: PBEPBE/SDD
title: #p freq=noraman PBEPBE/SDD
converged: YES YES NO NO
title: Mulliken charges:
elementType: S N N N N C C C C C C C C C C H H H H H H H H H H H H H H
charge: 0.252989 -0.153149 -0.050925 -0.020746 -0.011876 0.130885 0.099771 -0.341562 -0.320087 -0.334509 -0.230214 -0.657432 -0.638301 -0.666759 -0.386291 0.249735 0.215168 0.291983 0.268609 0.222410 0.223151 0.253879 0.206878 0.258156 0.218353 0.216802 0.236405 0.220999 0.245678
chargesum: 0.00000
title: Mulliken charges with hydrogens summed into heavy atoms:
elementType: S N N N N C C C C C C C C C C
charge: 0.252989 -0.153149 -0.050925 -0.020746 -0.011876 0.130885 0.099771 0.123341 -0.028103 -0.334509 0.038395 0.042009 0.045087 0.007448 -0.140613
polarizability: 2.42028091e+02 4.67287579e+00 1.49558852e+02 2.68139190e+00 -5.91997655e+00 8.97660910e+01
1716.lowfreq: -5.9202 -0.0012 -0.0006 0.0010 6.4749 10.4860 34.2491 39.6520 51.0828
frequency: 33.7618 39.6192 51.0441 73.3655 97.1531 144.0482 171.5434 196.5828 216.5114 230.8245 248.6638 261.3423 272.3703 291.0502 337.6579 385.6342 402.4565 441.8305 510.3698 540.2675 551.0779 591.3445 628.4676 645.1997 654.6656 694.3944 789.8480 792.1178 812.8169 832.8367 884.0178 902.8688 919.1175 923.9412 950.7877 966.0202 1059.7801 1063.4496 1091.7710 1103.0145 1136.7554 1154.3928 1165.3173 1194.6034 1208.6378 1251.1545 1261.9585 1291.0437 1301.7173 1309.4472 1343.8817 1355.8037 1367.7746 1380.4261 1392.5132 1393.8584 1397.6117 1438.2016 1458.9864 1464.8797 1468.6919 1475.0921 1476.6813 1485.0295 1485.8952 1516.2790 1543.7594 2976.8349 2980.5390 2993.9524 3019.4988 3052.6166 3067.8364 3074.6794 3078.4387 3091.8690 3093.6433 3103.6310 3108.5325 3167.5167 3226.3511
redmass: 3.3180 2.7819 3.0017 4.9050 3.5505 6.2488 2.5580 2.1837 1.0407 4.3689 1.1720 2.5351 2.4820 2.9253 3.0206 3.0480 3.8641 6.0903 4.2073 4.9023 5.5760 4.5886 7.2452 5.0647 5.3858 5.3528 1.9653 1.9728 10.0164 1.6456 2.6833 6.5121 1.4293 1.1694 1.3838 2.3332 2.2026 1.4183 1.9767 5.4833 2.3281 4.2412 1.9585 2.5812 1.9274 1.3356 1.8805 6.8096 4.6642 1.4166 1.6992 1.5494 4.3709 1.2181 1.5511 1.2666 1.2150 2.7289 1.0490 1.0448 1.0787 1.2603 1.0466 1.0459 1.0657 8.1127 8.1868 1.0373 1.0361 1.0356 1.0601 1.0891 1.0982 1.1037 1.0955 1.0995 1.0998 1.0999 1.1026 1.0921 1.0983
irintensity: 1.8219 0.8016 0.4713 0.3166 3.3573 0.1370 3.9244 0.8381 0.0658 1.4686 0.0437 0.6508 0.2544 0.3512 0.2021 1.0154 2.4197 7.2716 2.3218 7.2478 16.1069 1.4188 3.5906 14.3506 4.1067 7.1652 9.9220 7.6732 46.9053 12.7862 4.2393 81.4935 11.8281 8.3703 0.0445 0.4032 8.3396 46.0288 6.4354 25.9983 11.4827 94.9394 21.8417 0.8603 89.3617 21.2422 10.0594 76.2133 52.0658 3.1643 39.6672 3.9269 16.4460 29.4846 46.0917 12.2282 26.2027 44.0059 6.4603 3.2795 17.2638 25.4681 5.5518 16.2977 17.0005 213.7202 98.4240 25.2387 50.4085 22.2492 33.3842 4.1205 2.2425 2.2228 49.3052 25.6669 39.3296 20.8912 24.3924 16.2952 0.2409
temp: 298.150 k
press: 1.00000 atm
elementType: 16 7 7 7 7 6 6 6 6 6 6 6 6 6 6 1 1 1 1 1 1 1 1 1 1 1 1 1 1
symmnumber: 1
zpe: 607463.5 jmol-1
zpe.correction: 0.231371 hartree
zpe.thermalcorrener: 0.246560 hartree
zpe.thermalcorrenthalpy: 0.247504 hartree
zpe.thermalcorrgfe: 0.187802 hartree
zpe.sumelectzpe: -1005.415938 hartree
zpe.sumelectthermal: -1005.400748 hartree
zpe.sumelectthermalent: -1005.399804 hartree
zpe.sumelectthermalfe: -1005.459506 hartree
dipole: -2.6236 0.8012 0.0493
dipole: 2.7436
quadrupole: -68.1156 -102.4882 -97.9610
quadrupole: 7.2382 -0.5444 1.0854
quadrupole: 21.4060 -12.9666 -8.4394 7.2382 -0.5444 1.0854
hfenergy: -1005.6473083 hartree
pointgroup: C01 [X(C10H14N4S1)]
dipole: -1.0335958 -0.2845336 -0.1260285 debye
polarizability: 241.1528412|1.1422186|138.6831162|-12.6595183|23.6113237|101.5170768 unknown
InChI: InChI=1S/C10H14N4S/c1-4-14-6-13-8-9(14)11-5-12-10(8)15-7(2)3/h5-7H,4H2,1-3H3
charge 0 multiplicity 1
29 atoms
S  2.336933 1.276162 0.171929
N  -2.655829 0.533111 0.387634
N  -0.88283 1.954649 0.766236
N  -1.425399 -1.411763 -0.531724
N  0.992473 -1.006918 -0.623555
C  -1.509476 -0.152754 -0.018074
C  -0.417303 0.74217 0.226592
C  -4.041566 0.03353 0.286603
C  3.728596 0.118344 -0.485032
C  0.87484 0.251647 -0.105103
C  -2.216293 1.786415 0.841897
C  -4.617471 0.183944 -1.135747
C  3.800193 0.191726 -2.017888
C  5.027334 0.550524 0.215542
C  -0.136728 -1.763682 -0.807105
H  -4.031923 -1.03042 0.581027
H  -4.651703 0.586977 1.022547
H  3.412325 -0.890301 -0.170646
H  -2.912133 2.53294 1.220983
H  -4.630612 1.241577 -1.452599
H  -5.652882 -0.200217 -1.16379
H  -4.015687 -0.393635 -1.857391
H  4.601897 -0.479067 -2.384616
H  2.848698 -0.13382 -2.469504
H  4.02631 1.217923 -2.359325
H  5.857222 -0.097744 -0.123418
H  4.946356 0.463917 1.312928
H  5.294264 1.594399 -0.032945
H  0.019493 -2.763932 -1.221059
