program: Gaussian 09
title: 000256666
version: EM64L-G09RevD.01
frameworkgroup: C1[X(C17H13NO2)]
method: RPBEPBE
basis: SDD
operation: Freq
keyword: #p
keyword: freq=noraman
keyword: PBEPBE/SDD
title: #p freq=noraman PBEPBE/SDD
converged: YES YES NO NO
title: Mulliken charges:
elementType: O O N C C C C C C C C C C C C C C C C C H H H H H H H H H H H H H
charge: -0.206317 -0.184690 -0.350576 0.181709 0.364717 0.081248 -0.450307 0.483619 0.145411 -0.351942 -0.352265 0.447879 -0.397862 -0.399985 -0.355668 -0.351561 -0.221975 -0.222556 -0.805102 -0.244027 0.272649 0.226051 0.293982 0.235381 0.236653 0.269326 0.267426 0.228864 0.228135 0.230942 0.228914 0.241979 0.229945
chargesum: 0.00000
title: Mulliken charges with hydrogens summed into heavy atoms:
elementType: O O N C C C C C C C C C C C C C C C C C
charge: -0.206317 -0.184690 -0.350576 0.181709 0.364717 0.081248 -0.177658 0.483619 0.145411 -0.125891 -0.058283 0.447879 -0.162482 -0.163331 -0.086341 -0.084135 0.006889 0.005579 -0.103266 -0.014083
polarizability: 3.61318704e+02 2.21905681e+01 2.00926670e+02 3.73645240e+00 5.42834226e+00 9.10620608e+01
1716.lowfreq: -5.6686 -0.0009 -0.0007 -0.0006 3.3726 5.1902 16.9550 33.8029 36.6205
frequency: 16.5454 33.7963 36.4883 50.9787 69.9204 84.7444 133.1038 156.5410 173.0759 222.2383 270.8705 274.5587 289.4227 313.5419 357.4569 379.0051 398.7291 404.3687 434.3811 467.4556 503.4148 534.7671 577.6011 601.0193 613.0442 633.6136 666.5335 683.1232 693.1768 696.9267 724.5308 755.7147 762.5074 776.0170 813.0229 835.0660 836.2027 844.3520 863.8894 911.4493 956.0647 969.2174 969.3081 987.9651 989.6805 991.3527 999.5154 1010.0245 1015.3149 1032.2018 1046.3312 1079.4969 1103.5567 1130.5621 1175.0104 1181.1184 1197.3483 1204.7344 1222.2752 1233.4334 1294.2524 1321.5395 1328.8316 1347.6273 1365.9250 1383.1313 1397.3115 1421.1814 1444.0844 1467.3979 1472.4187 1489.5349 1505.1167 1561.6531 1591.9762 1602.9523 1611.5267 1615.2410 1621.2909 1665.0612 2975.8823 3057.7392 3089.6871 3124.6090 3131.0178 3131.2899 3143.8415 3149.8550 3161.9230 3176.2439 3185.7056 3189.8846 3216.2718
redmass: 3.8939 4.2388 1.0564 5.1155 5.0482 5.1915 5.9275 5.2976 6.2848 5.9822 5.2852 4.4499 5.0693 8.9874 4.6682 3.8584 2.8594 2.8394 4.1246 8.4524 3.1712 3.1040 5.9085 9.0840 6.3329 7.0613 4.8902 3.4720 2.0229 6.4307 3.4765 2.4840 3.7847 3.4123 6.0961 1.5107 1.2539 1.6100 1.3958 1.4343 7.6379 1.3914 1.3559 1.4163 5.8315 1.3412 1.3566 3.8502 3.0958 2.1638 1.5915 2.4464 2.0875 1.3823 1.0487 3.1676 1.2519 1.1554 1.9656 2.2412 3.6710 1.4123 1.3155 6.5218 4.9041 9.0233 1.2203 3.4935 2.3328 1.1102 1.0578 2.3854 2.6358 5.3939 6.4859 7.9465 6.1121 9.7920 6.8420 11.4746 1.0393 1.0939 1.1001 1.0874 1.0905 1.0854 1.0907 1.0963 1.0971 1.0950 1.0946 1.0968 1.0979
irintensity: 0.0069 1.0421 0.7214 0.9110 0.6798 1.1034 0.9654 5.1824 0.9081 2.0564 1.2154 0.1036 0.4523 7.5962 0.7412 0.3344 0.0913 0.8412 5.6213 15.0223 20.2806 5.3012 7.0916 31.2836 0.5028 0.4669 8.4240 5.7304 39.7279 4.3980 1.6842 31.6670 21.1045 11.2663 3.3568 71.8402 0.0613 31.0271 1.1952 4.8808 18.8971 0.1412 1.7317 0.3207 0.3905 0.6736 2.6308 9.1341 11.8490 9.0371 28.7941 7.7273 42.0675 8.9804 0.1604 197.0707 19.8174 27.2259 8.2959 0.8590 54.8894 5.8635 4.3218 493.1156 9.5973 0.2132 14.4314 4.8495 19.2607 19.7519 14.0907 157.4784 50.2325 11.5395 61.7363 310.5971 28.0661 317.4861 38.3555 58.5845 26.3067 21.9060 15.3141 11.1294 21.3466 0.1323 18.9150 15.7345 38.9976 11.7246 3.6033 0.7226 6.5503
temp: 298.150 k
press: 1.00000 atm
elementType: 8 8 7 6 6 6 6 6 6 6 6 6 6 6 6 6 6 6 6 6 1 1 1 1 1 1 1 1 1 1 1 1 1
symmnumber: 1
zpe: 661712.6 jmol-1
zpe.correction: 0.252033 hartree
zpe.thermalcorrener: 0.268900 hartree
zpe.thermalcorrenthalpy: 0.269844 hartree
zpe.thermalcorrgfe: 0.204781 hartree
zpe.sumelectzpe: -859.454706 hartree
zpe.sumelectthermal: -859.437839 hartree
zpe.sumelectthermalent: -859.436895 hartree
zpe.sumelectthermalfe: -859.501959 hartree
dipole: -3.9138 -0.5598 0.0388
dipole: 3.9539
quadrupole: -86.8960 -116.3370 -118.6673
quadrupole: -7.3153 2.8543 4.2750
quadrupole: 20.4041 -9.0369 -11.3672 -7.3153 2.8543 4.2750
hfenergy: -859.7067391 hartree
pointgroup: C01 [X(C17H13N1O2)]
dipole: 1.5383299 0.2309221 0.0012721 debye
polarizability: 361.050297|22.9162657|199.6085441|-4.7405284|-14.2622671|92.6485936 unknown
InChI: InChI=1S/C17H13NO2/c1-12-7-9-13(10-8-12)15-11-16(19)18(17(15)20)14-5-3-2-4-6-14/h2-11H,1H3
charge 0 multiplicity 1
33 atoms
O  -0.268124 1.622289 0.025285
O  -1.948302 -2.777516 -0.054508
N  -1.492798 -0.417934 -0.010611
C  0.875246 -0.610241 0.006787
C  2.286109 -0.209784 0.027073
C  -0.303883 0.366459 0.007806
C  0.341295 -1.876798 -0.016308
C  -2.835762 0.099651 -0.011389
C  -1.138779 -1.818141 -0.027819
C  3.311223 -1.202938 -0.004444
C  2.684225 1.15881 0.083857
C  5.067157 0.520856 0.070671
C  4.668323 -0.843951 0.018321
C  4.0484 1.507562 0.106444
C  -3.853888 -0.58751 0.696116
C  -3.138736 1.290349 -0.718182
C  -5.171415 -0.082674 0.686982
C  -4.457699 1.791414 -0.706073
C  6.533699 0.905263 0.064838
C  -5.480233 1.10862 -0.008538
H  0.857552 -2.835739 -0.02633
H  3.042843 -2.264299 -0.045436
H  1.915745 1.935381 0.114023
H  5.435628 -1.626998 -0.003877
H  4.328753 2.566484 0.154613
H  -3.621353 -1.510255 1.232168
H  -2.352271 1.823907 -1.256283
H  -5.955397 -0.621235 1.230361
H  -4.684988 2.715414 -1.24884
H  6.703744 1.864382 0.583967
H  7.158221 0.134336 0.54922
H  6.905312 1.02343 -0.972079
H  -6.503547 1.499302 -0.007318
