program: Gaussian 09
title: 000256662
version: EM64L-G09RevD.01
frameworkgroup: C1[X(C15H16N2O2)]
method: RPBEPBE
basis: SDD
operation: Freq
keyword: #p
keyword: freq=noraman
keyword: PBEPBE/SDD
title: #p freq=noraman PBEPBE/SDD
converged: NO YES NO NO
title: Mulliken charges:
elementType: O O N N C C C C C C C C C C C C C C C H H H H H H H H H H H H H H H H
charge: -0.267754 -0.289058 -0.083688 -0.064403 -0.542628 -0.412185 -0.488286 0.293553 0.258811 -0.409766 -0.360730 -0.154841 -0.235576 -0.245131 0.053750 0.209389 -0.191446 -0.224598 -0.670809 0.241767 0.227610 0.231376 0.243402 0.261159 0.278319 0.236931 0.243905 0.268291 0.232479 0.234149 0.226166 0.226049 0.206548 0.233734 0.233512
chargesum: 0.00000
title: Mulliken charges with hydrogens summed into heavy atoms:
elementType: O O N N C C C C C C C C C C C C C C C
charge: -0.267754 -0.289058 -0.083688 -0.064403 -0.073252 0.062592 0.051192 0.293553 0.258811 -0.172835 -0.116825 0.113450 -0.003097 -0.010982 0.053750 0.209389 -0.191446 0.227618 0.002985
polarizability: 2.79959946e+02 -3.95128260e+00 1.90857321e+02 -1.68188118e+00 5.82175884e+00 9.64301415e+01
1716.lowfreq: -6.1069 -0.0006 0.0006 0.0008 3.1577 9.6668 18.0911 30.9180 44.1071
frequency: 18.0019 30.7763 44.0661 57.3471 68.5798 99.6587 110.1601 120.3800 156.3429 165.2610 194.9057 214.7763 234.3578 255.5124 283.1974 326.9471 344.4585 382.2113 400.3570 425.3096 441.9430 452.8739 482.8372 502.1824 529.1444 572.4327 578.5159 636.8540 715.4669 715.9377 730.5436 735.8874 756.7079 787.0059 795.3720 799.0363 855.0906 869.6904 875.3020 929.8208 942.7185 967.1303 985.1275 992.8378 997.5836 1021.9574 1037.6621 1051.7853 1073.6826 1112.9440 1114.2452 1135.7441 1145.8014 1176.7244 1187.2572 1202.0779 1209.7268 1225.6577 1247.2401 1248.1825 1251.4687 1284.2088 1337.6966 1349.5324 1354.2343 1360.2666 1381.1512 1394.4248 1401.1021 1418.9323 1444.2831 1453.7652 1461.5067 1463.6744 1473.5049 1474.1121 1487.1063 1493.4704 1579.7073 1597.7550 1618.2889 1643.6450 2156.1521 2971.9203 2978.3009 2985.9382 2996.3276 3007.6937 3040.9387 3048.6041 3066.3960 3076.4270 3092.8302 3109.7047 3118.6596 3118.8270 3122.8046 3143.1436 3164.5970
redmass: 5.1999 3.0086 4.2658 4.6563 2.9808 4.3467 3.0903 5.0577 3.6422 4.5884 5.0893 2.9837 1.8996 2.0448 5.4744 2.5849 4.6677 3.8952 3.6050 2.8973 5.5598 3.8682 4.8286 3.7270 9.7719 7.7586 4.0182 3.7985 3.5380 8.8803 4.8292 4.6269 1.2770 4.4698 3.0914 1.1089 4.1837 2.7931 1.5017 2.3258 1.5085 1.3880 1.5986 1.3641 2.3361 2.3812 2.3365 2.6440 3.8255 2.1967 1.9012 1.4613 3.2990 1.0633 1.3255 2.1716 1.5819 1.6804 1.1756 2.5938 1.2854 1.5080 1.6609 1.3600 1.7686 1.4645 2.2462 2.7310 1.2745 2.3091 2.3538 1.1107 1.0399 1.1233 1.0983 1.0610 1.0699 2.3791 10.3123 6.9325 6.4260 7.6869 12.6039 1.0649 1.0680 1.0610 1.0362 1.0578 1.0954 1.0987 1.1069 1.0985 1.0984 1.1023 1.0894 1.0872 1.0898 1.0930 1.1005
irintensity: 0.3255 0.9453 1.9641 0.3769 4.0269 1.1967 1.7386 1.5713 1.2448 5.2102 2.0704 4.7983 7.7694 8.6582 2.6012 2.4867 11.2654 2.4811 5.9472 5.4703 0.8267 5.5671 1.1469 0.6323 2.7368 1.1561 0.8533 4.8439 1.5380 15.9755 2.4813 4.5835 75.3998 2.6228 4.1535 3.0109 16.7546 2.6734 1.3348 29.0166 1.1392 18.5618 3.3396 0.1098 9.5742 22.3004 26.9246 165.0690 188.1570 14.2769 5.1930 5.6247 235.7112 2.8152 1.2709 51.4267 190.5764 8.4133 15.9220 269.3878 5.3037 30.5106 11.2975 0.7106 30.6714 17.9483 11.8450 1.3164 19.3968 15.7715 4.3204 15.2595 11.7741 29.2895 65.7827 2.0176 13.1791 24.7806 472.1473 11.9329 1.7770 496.4526 67.9870 9.3491 35.7530 25.0940 22.6086 27.1694 3.6039 32.5753 11.8488 24.3791 32.7236 41.7265 2.2743 8.8034 1.9744 21.1249 28.8426
temp: 298.150 k
press: 1.00000 atm
elementType: 8 8 7 7 6 6 6 6 6 6 6 6 6 6 6 6 6 6 6 1 1 1 1 1 1 1 1 1 1 1 1 1 1 1 1
symmnumber: 1
zpe: 733875.7 jmol-1
zpe.correction: 0.279519 hartree
zpe.thermalcorrener: 0.297541 hartree
zpe.thermalcorrenthalpy: 0.298485 hartree
zpe.thermalcorrgfe: 0.231186 hartree
zpe.sumelectzpe: -839.759031 hartree
zpe.sumelectthermal: -839.741009 hartree
zpe.sumelectthermalent: -839.740065 hartree
zpe.sumelectthermalfe: -839.807363 hartree
dipole: 4.0311 -3.2121 0.2426
dipole: 5.1601
quadrupole: -91.1317 -117.5329 -112.2610
quadrupole: -2.0773 0.8743 -0.3616
quadrupole: 15.8435 -10.5577 -5.2858 -2.0773 0.8743 -0.3616
hfenergy: -840.0385497 hartree
pointgroup: C01 [X(C15H16N2O2)]
dipole: -1.5209279 1.2835221 -0.4009414 debye
polarizability: 279.3646244|-7.7578606|174.1901394|3.1291084|-37.1130836|113.6926445 unknown
InChI: InChI=1S/C15H16N2O2/c1-2-19-15(18)14(9-16)11-17-8-7-12-5-3-4-6-13(12)10-17/h3-6,11H,2,7-8,10H2,1H3
charge 0 multiplicity 1
35 atoms
O  4.225032 -0.573469 0.06031
O  3.595037 1.543941 -0.70105
N  -0.431754 0.887782 0.065891
N  1.568285 -2.403708 1.180804
C  -2.428105 1.817429 -1.082139
C  -1.248997 2.110792 -0.136123
C  -1.139188 -0.32792 0.542994
C  -3.26231 0.669803 -0.534632
C  -2.638595 -0.323639 0.263593
C  -4.654104 0.583853 -0.786616
C  -3.415059 -1.382209 0.797207
C  0.916751 0.941212 -0.094085
C  -5.421968 -0.477268 -0.263452
C  -4.797835 -1.465219 0.535138
C  1.913508 -0.014456 0.139986
C  3.287145 0.419856 -0.214224
C  1.717441 -1.314985 0.700228
C  5.645301 -0.239937 -0.259013
C  6.472363 -1.466422 0.112033
H  -2.033533 1.570739 -2.087534
H  -3.047849 2.726811 -1.190081
H  -0.594541 2.899324 -0.543671
H  -1.636881 2.456829 0.843244
H  -0.957815 -0.461253 1.628702
H  -0.683596 -1.201711 0.0434
H  -5.135486 1.3582 -1.396528
H  -2.930892 -2.147757 1.416274
H  1.303738 1.894463 -0.478406
H  -6.496561 -0.532005 -0.468658
H  -5.38529 -2.29027 0.95186
H  5.71173 0.009167 -1.333817
H  5.931599 0.656959 0.320006
H  7.540116 -1.277877 -0.103567
H  6.367905 -1.700475 1.185021
H  6.148709 -2.34808 -0.466695
