program: Gaussian 09
title: 000256658
version: EM64L-G09RevD.01
frameworkgroup: C1[X(C17H13BrN2)]
method: RPBEPBE
basis: SDD
operation: Freq
keyword: #p
keyword: freq=noraman
keyword: PBEPBE/SDD
title: #p freq=noraman PBEPBE/SDD
converged: YES YES NO NO
title: Mulliken charges:
elementType: Br N N C C C C C C C C C C C C C C C C C H H H H H H H H H H H H H
charge: 0.011921 -0.405251 -0.405283 -0.402521 0.026853 0.338592 0.338625 0.477800 0.569413 -0.463114 -0.462937 -0.495807 -0.495798 -0.207396 -0.207304 -0.350734 -0.463378 -0.195038 -0.173738 -0.224481 0.247473 0.289766 0.289780 0.219463 0.219442 0.236071 0.236060 0.219423 0.219400 0.273108 0.234474 0.253411 0.251707
chargesum: 0.00000
title: Mulliken charges with hydrogens summed into heavy atoms:
elementType: Br N N C C C C C C C C C C C C C C C C C
charge: 0.011921 -0.115486 -0.115503 -0.155048 0.026853 0.338592 0.338625 0.477800 0.569413 -0.243652 -0.243495 -0.259737 -0.259738 0.012028 0.012096 -0.077626 -0.228904 0.058373 0.077969 -0.224481
polarizability: 2.96012141e+02 -2.80959652e-01 1.95849064e+02 4.10784545e+01 -2.04270923e-02 1.83259450e+02
1716.lowfreq: -0.6377 -0.0007 -0.0006 -0.0004 5.7908 6.4184 15.4908 31.1539 35.9829
frequency: 15.3937 31.1479 35.9704 92.6777 130.4844 161.9743 195.5244 200.6765 248.7671 261.9869 282.2020 332.3776 377.8908 401.9487 419.1711 420.0337 439.5227 464.3981 473.6461 476.6638 501.4367 507.7667 552.6203 575.7688 608.7854 626.1256 628.6767 639.5484 658.8734 724.5004 751.0912 757.2694 773.0708 796.4698 809.9699 822.3686 832.7564 832.9007 839.1061 848.4969 880.0153 952.9281 954.7078 958.6110 967.8268 975.9029 994.1734 1037.5089 1059.0838 1077.0734 1087.3676 1100.2891 1118.1477 1144.4916 1178.9125 1182.3113 1189.9648 1198.0084 1227.9586 1283.6413 1286.4812 1288.2191 1296.7063 1318.2329 1380.9792 1386.5761 1401.9785 1408.6045 1421.8146 1446.4907 1452.4862 1468.0676 1477.1711 1496.2106 1531.5577 1578.6696 1588.0603 1592.6415 1614.2663 1632.0427 2970.3356 3113.3357 3119.5060 3119.6780 3133.0603 3134.4314 3149.3900 3154.6159 3156.8277 3168.0137 3172.7842 3561.8942 3562.4421
redmass: 4.1673 7.5414 5.4620 6.7388 6.2692 5.0993 4.9049 7.7213 3.7091 5.0471 4.6241 3.5257 4.3868 2.7128 4.2225 2.0278 3.9533 2.3222 1.8237 3.6919 3.5050 4.7676 3.3280 5.0193 6.1442 5.8034 4.2714 2.8726 6.2510 3.4495 1.3068 1.6338 5.9284 5.0823 3.7537 3.0203 1.3441 4.8990 1.5712 1.4209 1.6164 1.3573 4.3190 1.3186 1.3556 1.3711 4.9702 3.4260 2.7398 2.0351 2.8821 1.9050 1.4897 1.8603 2.4841 1.2420 1.1971 1.4169 1.6658 1.4355 1.8502 1.3654 1.7104 1.6589 5.2941 3.4647 2.0870 1.8558 4.1758 6.1640 2.0502 2.2676 2.2493 1.7308 4.4772 6.8530 5.8841 5.1733 7.4235 6.4690 1.0867 1.0897 1.0862 1.0862 1.0909 1.0904 1.0891 1.0996 1.0988 1.0946 1.0967 1.0775 1.0760
irintensity: 0.1150 0.1371 0.0782 0.0597 0.1777 4.7036 0.0386 4.8844 0.0060 32.9599 0.3271 0.0321 1.0764 0.5438 4.5849 8.1229 0.0063 71.3957 140.7776 7.0868 7.1720 36.8761 27.2410 2.0435 0.9208 0.6812 3.2380 0.8657 15.7837 2.6884 0.0628 110.5844 7.4580 95.6020 12.9695 48.8408 9.6909 25.1091 25.5585 0.1288 7.5688 0.0039 10.2419 0.0064 3.7775 0.3033 50.0913 14.4774 30.8681 16.3969 2.0877 54.6702 8.9354 7.6736 9.3752 13.4238 1.3487 7.2914 0.3098 25.3685 8.3208 5.8202 0.0214 13.5652 7.1435 20.6637 54.4139 7.8606 63.0844 67.7882 1.6774 77.0940 2.9163 62.4459 0.0104 4.2894 14.4444 16.5929 407.6567 37.0895 58.5589 12.2792 0.6662 19.3399 15.3980 16.3471 1.2421 46.0174 28.0470 8.5820 0.9388 19.1612 19.8308
temp: 298.150 k
press: 1.00000 atm
elementType: 35 7 7 6 6 6 6 6 6 6 6 6 6 6 6 6 6 6 6 6 1 1 1 1 1 1 1 1 1 1 1 1 1
symmnumber: 1
zpe: 668129.7 jmol-1
zpe.correction: 0.254477 hartree
zpe.thermalcorrener: 0.270265 hartree
zpe.thermalcorrenthalpy: 0.271209 hartree
zpe.thermalcorrgfe: 0.208782 hartree
zpe.sumelectzpe: -777.221701 hartree
zpe.sumelectthermal: -777.205913 hartree
zpe.sumelectthermalent: -777.204969 hartree
zpe.sumelectthermalfe: -777.267396 hartree
dipole: 0.8419 -0.0167 2.4369
dipole: 2.5783
quadrupole: -141.1677 -116.4556 -115.3459
quadrupole: -0.0681 9.7348 -0.0336
quadrupole: -16.8447 7.8675 8.9772 -0.0681 9.7348 -0.0336
hfenergy: -777.4761777 hartree
pointgroup: C01 [X(C17H13Br1N2)]
dipole: 0.4739354 0.1838534 0.8777977 debye
polarizability: 305.7899914|4.6947364|194.8910941|21.6194652|-4.5278337|174.4395691 unknown
InChI: InChI=1S/C17H13BrN2/c18-13-9-7-12(8-10-13)17-19-14-5-1-3-11-4-2-6-15(20-17)16(11)14/h1-10,17,19-20H
charge 0 multiplicity 1
33 atoms
Br 5.755252 -0.398329 -1.956058
N  -0.224288 1.484826 1.263551
N  -0.219806 -0.85872 1.752065
C  0.621113 0.349097 1.672456
C  -1.846808 0.029982 0.165712
C  -1.290621 1.342643 0.36288
C  -1.286337 -1.092307 0.871119
C  -2.979022 -0.154176 -0.707557
C  1.858333 0.163534 0.769828
C  -1.851487 2.446702 -0.307094
C  -1.843636 -2.373921 0.69973
C  -3.526619 0.990891 -1.376289
C  -3.522785 -1.472813 -0.861501
C  -2.969436 2.257828 -1.170052
C  -2.961817 -2.549555 -0.165695
C  1.734252 -0.122773 -0.61625
C  3.153498 0.279625 1.329292
C  2.87907 -0.289292 -1.422849
C  4.313179 0.115985 0.535783
C  4.157802 -0.16752 -0.834987
H  0.995229 0.562818 2.694868
H  0.206767 2.406021 1.342917
H  0.214322 -1.669465 2.193548
H  -1.43216 3.449725 -0.163612
H  -1.421246 -3.23441 1.232313
H  -4.385826 0.860144 -2.043058
H  -4.381857 -1.622771 -1.524396
H  -3.392598 3.129488 -1.682271
H  -3.381968 -3.554686 -0.285854
H  0.743526 -0.217609 -1.072644
H  3.268326 0.500776 2.398542
H  2.778346 -0.50998 -2.489337
H  5.309901 0.207743 0.976602
