program: Gaussian 09
title: 000256656
version: EM64L-G09RevD.01
frameworkgroup: C1[X(C18H16N2O)]
method: RPBEPBE
basis: SDD
operation: Freq
keyword: #p
keyword: freq=noraman
keyword: PBEPBE/SDD
title: #p freq=noraman PBEPBE/SDD
converged: YES YES NO NO
title: Mulliken charges:
elementType: O N N C C C C C C C C C C C C C C C C C C H H H H H H H H H H H H H H H H
charge: -0.269541 -0.401869 -0.402094 -0.412713 0.023763 0.339195 0.339305 0.590819 0.472833 -0.465510 -0.465742 -0.499804 -0.499847 -0.496784 -0.506132 -0.209080 -0.209079 0.312918 -0.190400 -0.372676 -0.540593 0.246520 0.288807 0.288806 0.219526 0.219545 0.235469 0.235475 0.277164 0.230016 0.218572 0.218572 0.227627 0.253988 0.242989 0.230017 0.229936
chargesum: 0.00000
title: Mulliken charges with hydrogens summed into heavy atoms:
elementType: O N N C C C C C C C C C C C C C C C C C C
charge: -0.269541 -0.113062 -0.113287 -0.166192 0.023763 0.339195 0.339305 0.590819 0.472833 -0.245984 -0.246197 -0.264334 -0.264372 -0.219620 -0.276116 0.009492 0.009492 0.312918 0.037226 -0.118688 0.162348
polarizability: 2.60751941e+02 4.95723339e+01 1.89434077e+02 -2.55245659e-01 1.89196674e-01 2.01780636e+02
1716.lowfreq: -8.6998 -6.2239 -2.3415 -0.0009 -0.0008 -0.0007 12.0464 33.8996 41.4454
frequency: 11.8654 33.8785 41.4339 104.6258 120.2028 143.8146 163.6572 202.2260 231.6926 238.0623 265.0934 281.0989 299.5835 320.4135 413.8369 418.5816 429.8724 435.8659 463.9264 470.8987 476.9922 478.0629 499.6512 509.5324 534.8208 576.4156 601.3497 625.0857 625.2053 640.2103 640.6383 703.4315 722.1284 751.5642 757.2954 773.7816 794.3343 814.9611 818.7030 828.3723 846.4911 869.2415 878.6461 890.4318 906.3651 955.2941 957.7629 967.2513 971.7203 980.3035 1002.0366 1037.1721 1073.4377 1080.6941 1086.5031 1108.0065 1111.6278 1142.2554 1153.7683 1157.0861 1171.3852 1181.5593 1196.6404 1227.1823 1240.7717 1284.2776 1286.7867 1290.0826 1296.7801 1337.6344 1386.5578 1395.5420 1407.5642 1420.0165 1432.0246 1444.8619 1451.7397 1454.4746 1467.1614 1468.4712 1476.4029 1481.6482 1495.3760 1531.3090 1590.6942 1594.8142 1606.0410 1614.8745 1630.5347 2965.6143 2979.8628 3054.9135 3115.0332 3118.5492 3118.7076 3128.6406 3132.4703 3133.7103 3143.0090 3153.4873 3155.7286 3167.9354 3171.8621 3558.8146 3559.3262
redmass: 4.0850 5.6246 5.0525 3.2142 4.4814 4.0733 4.0641 1.7198 5.1006 3.6690 1.8726 3.6035 2.8769 3.8833 2.4288 4.2093 2.8024 4.6125 2.6874 3.4052 1.6685 3.4205 4.6834 3.4908 5.0683 4.8768 6.0826 4.5018 4.4974 2.9501 4.8933 1.9528 6.0521 1.3050 1.6425 5.7826 1.5748 3.8537 3.2284 4.2947 1.4247 1.6591 1.6036 1.4124 5.1923 4.4512 1.3149 1.3505 1.3284 5.6936 4.5783 3.4294 2.0548 1.7084 2.9525 1.9411 1.2619 1.8749 1.7092 1.4740 1.1374 1.2326 1.3496 1.6697 3.8695 1.4772 1.8902 1.4004 1.6597 1.4103 3.4313 6.4884 1.8518 4.6076 1.4352 4.7594 2.0485 1.9347 1.0484 1.3776 2.2563 1.6188 1.7272 4.4695 5.1437 6.4140 6.2069 7.2163 6.4500 1.0328 1.0866 1.1042 1.0880 1.0859 1.0859 1.1000 1.0910 1.0906 1.0919 1.0995 1.0988 1.0907 1.0968 1.0774 1.0760
irintensity: 0.3634 0.3082 0.1229 6.4077 0.9026 0.0369 8.0208 0.9656 12.8036 0.5022 0.8655 10.4613 1.1161 10.3858 2.2803 4.9737 4.5945 1.3265 33.6196 9.7928 144.5003 10.9849 15.9799 0.4505 16.9979 4.7201 15.2832 1.2657 1.2358 0.7696 33.4424 29.5932 68.0511 0.0904 100.8451 2.2053 46.0865 0.2646 68.9219 20.1977 0.3489 12.4039 8.0803 0.2851 2.6236 5.7968 0.0095 4.1001 1.1730 2.4294 19.3136 14.3448 33.2841 2.5590 2.3893 28.2757 0.2734 7.2816 40.1804 16.5325 9.1432 13.0136 2.9820 0.2210 116.5719 22.2274 7.7892 17.6810 0.0010 31.4079 21.7673 6.2231 5.1081 101.6641 15.9330 68.6997 1.9744 2.7179 15.8300 81.5833 3.3433 2.4018 60.5877 0.0002 14.0056 31.6763 71.0075 409.4496 38.1789 34.5190 59.0451 33.9584 8.8696 0.0187 18.3360 25.6185 16.3004 17.3683 25.8220 46.6530 26.7921 2.4146 12.2022 21.4398 18.6967
temp: 298.150 k
press: 1.00000 atm
elementType: 8 7 7 6 6 6 6 6 6 6 6 6 6 6 6 6 6 6 6 6 6 1 1 1 1 1 1 1 1 1 1 1 1 1 1 1 1
symmnumber: 1
zpe: 777334.2 jmol-1
zpe.correction: 0.296071 hartree
zpe.thermalcorrener: 0.312998 hartree
zpe.thermalcorrenthalpy: 0.313942 hartree
zpe.thermalcorrgfe: 0.250306 hartree
zpe.sumelectzpe: -878.785764 hartree
zpe.sumelectthermal: -878.768837 hartree
zpe.sumelectthermalent: -878.767893 hartree
zpe.sumelectthermalfe: -878.831528 hartree
dipole: -1.6652 -0.8207 0.0094
dipole: 1.8565
quadrupole: -127.3790 -113.9086 -113.9012
quadrupole: 13.2318 -0.0722 0.0277
quadrupole: -8.9827 4.4877 4.4950 13.2318 -0.0722 0.0277
hfenergy: -879.0818348 hartree
pointgroup: C01 [X(C18H16N2O1)]
dipole: 0.6628085 0.3068843 -0.0007794 debye
polarizability: 263.1191395|47.7792513|187.0641258|-0.4389807|0.0037542|201.7833893 unknown
InChI: InChI=1S/C18H16N2O/c1-21-14-8-2-7-13(11-14)18-19-15-9-3-5-12-6-4-10-16(20-18)17(12)15/h2-11,18-20H,1H3
charge 0 multiplicity 1
37 atoms
O  2.853113 -2.635686 0.022749
N  -0.162484 1.770095 -1.209447
N  -0.1627 1.786689 1.18356
C  0.686433 1.938373 -0.01393
C  -1.782124 0.400605 -0.003607
C  -1.225008 0.856709 -1.250603
C  -1.22561 0.874368 1.237076
C  1.916103 1.008506 -0.007654
C  -2.908282 -0.499751 0.002509
C  -1.78225 0.41418 -2.466452
C  -1.783682 0.449397 2.458799
C  -3.450347 -0.933646 -1.253185
C  -3.451134 -0.915598 1.263963
C  1.755562 -0.40272 0.005319
C  3.21261 1.571306 -0.015453
C  -2.894325 -0.476169 -2.453463
C  -2.895834 -0.440968 2.457896
C  2.897533 -1.234795 0.010168
C  4.351054 0.726551 -0.010461
C  4.202058 -0.671289 0.002271
C  1.529499 -3.269438 0.03112
H  1.067636 2.979618 -0.0212
H  0.276787 2.021217 -2.09553
H  0.27626 2.050161 2.066196
H  -1.363784 0.756401 -3.420526
H  -1.36582 0.805268 3.408136
H  -4.305893 -1.617833 -1.258392
H  -4.306705 -1.599622 1.278425
H  0.748707 -0.828657 0.011443
H  3.335688 2.661688 -0.025274
H  -3.314613 -0.807873 -3.409949
H  -3.316765 -0.75885 3.418779
H  5.356957 1.160583 -0.01643
H  5.06539 -1.343415 0.00636
H  1.730315 -4.350544 0.040496
H  0.950066 -3.003101 -0.873744
H  0.953694 -2.986759 0.93333
