program: Gaussian 09
title: 000256654
version: EM64L-G09RevD.01
frameworkgroup: C1[X(C17H13N3O2)]
method: RPBEPBE
basis: SDD
operation: Freq
keyword: #p
keyword: freq=noraman
keyword: PBEPBE/SDD
title: #p freq=noraman PBEPBE/SDD
converged: YES YES NO NO
title: Mulliken charges:
elementType: O O N N N C C C C C C C C C C C C C C C C C H H H H H H H H H H H H H
charge: -0.204792 -0.241342 -0.438256 -0.391301 0.009663 -0.339508 0.013648 0.331324 0.327502 0.399194 0.479997 -0.466465 -0.446456 0.171509 -0.496831 -0.492279 -0.311074 -0.204569 -0.202902 -0.354084 -0.249188 -0.217664 0.284750 0.299659 0.329510 0.224460 0.227632 0.238014 0.237010 0.273778 0.221960 0.221559 0.282461 0.239801 0.243280
chargesum: 0.00000
title: Mulliken charges with hydrogens summed into heavy atoms:
elementType: O O N N N C C C C C C C C C C C C C C C C C
charge: -0.204792 -0.241342 -0.138598 -0.061791 0.009663 -0.054757 0.013648 0.331324 0.327502 0.399194 0.479997 -0.242005 -0.218825 0.171509 -0.258817 -0.255270 -0.037296 0.017391 0.018658 -0.071623 -0.009387 0.025616
polarizability: 4.57326537e+02 -1.19191560e+01 2.16982667e+02 9.68249960e+00 1.00868919e+01 1.57207775e+02
1716.lowfreq: -12.9277 -7.7387 0.0006 0.0008 0.0010 4.9442 32.7888 39.3115 54.4286
frequency: 32.6309 39.2557 54.4047 88.2144 117.6865 153.8870 174.8160 181.2081 224.3855 240.9083 274.1049 307.5757 331.2266 384.1324 395.0878 417.2439 420.0414 437.3991 464.0522 468.3896 486.9467 500.4817 519.6666 557.6104 563.6242 587.8367 606.6983 627.8960 635.3984 642.8362 653.1689 658.5136 726.0529 754.1598 758.7193 763.1528 778.9757 783.5647 805.0151 814.0719 824.0277 836.8616 854.5474 884.4098 891.8107 956.1259 962.1635 971.3178 974.5369 1000.1450 1037.3948 1039.9751 1056.2769 1077.1759 1090.9520 1102.4552 1129.5949 1150.2616 1158.0502 1182.1522 1183.4698 1187.6040 1197.8755 1227.9994 1260.0160 1277.9550 1283.7752 1293.2314 1326.8466 1352.9228 1382.6125 1395.1300 1406.7154 1421.8748 1430.8241 1441.0953 1447.2141 1461.9361 1471.2966 1488.8154 1529.5000 1572.0554 1587.0543 1599.3347 1604.6062 1625.9764 3040.1557 3119.6539 3124.1948 3134.1750 3137.8054 3142.0851 3155.9936 3158.0896 3159.0214 3170.9727 3183.9090 3541.2589 3579.3818
redmass: 6.9236 6.0359 5.5826 9.6311 4.7260 4.2127 9.1603 5.1614 5.4690 4.1302 5.3881 5.7671 3.5644 2.1615 2.8132 3.3315 4.1552 4.7067 5.9168 3.5188 6.3031 4.4637 4.8976 2.8061 4.0369 1.9651 4.8526 3.3321 4.6156 2.9788 7.3056 5.8765 4.0235 1.3082 1.6748 6.3040 2.4308 2.2155 5.7657 4.6092 2.8970 3.9291 1.4348 1.5856 1.4842 4.2453 1.3209 1.3569 1.3822 1.3447 3.4606 2.8295 3.8302 2.1198 2.5605 2.2295 2.2586 1.8477 2.0913 1.2245 1.2956 3.4253 1.3428 1.6834 1.5361 1.5277 1.5137 2.2776 1.7453 3.1278 3.3758 5.6006 1.9055 3.9536 2.3338 2.5415 3.2399 2.3814 2.8613 1.8608 4.5180 6.3266 5.1802 6.5999 7.2290 6.5617 1.0863 1.0867 1.0855 1.0905 1.0913 1.0868 1.0995 1.0989 1.0907 1.0954 1.0981 1.0771 1.0775
irintensity: 0.6923 1.7574 0.0290 1.7255 1.8503 1.3774 1.3837 4.6178 13.7480 0.8540 3.8379 1.8737 4.7435 26.9516 48.5400 15.5574 2.9939 1.0299 7.7684 1.0972 1.4868 1.5694 6.5859 32.7440 11.9609 34.4734 21.6589 7.6422 24.6269 2.5498 4.0935 13.2715 12.5729 0.9088 92.5117 24.2043 31.8844 48.5767 2.2487 3.7218 50.8277 26.0378 2.3466 8.4931 4.3471 4.5979 0.1685 3.7244 2.0322 1.0744 12.0771 4.0400 19.0847 2.6186 2.3968 2.3880 1.4469 40.2175 155.4305 3.2495 18.5379 545.9645 2.7082 21.1161 6.0974 42.2799 2.9605 10.6123 24.8566 169.0457 21.4585 25.8029 1.9535 18.0599 0.5020 13.7555 37.3264 57.3208 8.6000 12.3796 0.2771 21.7902 26.2575 18.5011 75.5933 33.5717 5.3006 8.4847 6.0766 11.5938 11.7245 4.4931 44.1272 45.2793 7.6822 7.0401 8.9326 16.6319 29.0922
temp: 298.150 k
press: 1.00000 atm
elementType: 8 8 7 7 7 6 6 6 6 6 6 6 6 6 6 6 6 6 6 6 6 6 1 1 1 1 1 1 1 1 1 1 1 1 1
symmnumber: 1
zpe: 698115.0 jmol-1
zpe.correction: 0.265898 hartree
zpe.thermalcorrener: 0.282575 hartree
zpe.thermalcorrenthalpy: 0.283520 hartree
zpe.thermalcorrgfe: 0.221254 hartree
zpe.sumelectzpe: -968.736079 hartree
zpe.sumelectthermal: -968.719402 hartree
zpe.sumelectthermalent: -968.718458 hartree
zpe.sumelectthermalfe: -968.780723 hartree
dipole: 0.6807 -3.9449 1.3973
dipole: 4.2401
quadrupole: -137.0687 -119.5121 -121.7131
quadrupole: 8.1908 -5.6063 6.0174
quadrupole: -10.9708 6.5859 4.3849 8.1908 -5.6063 6.0174
hfenergy: -969.0019774 hartree
pointgroup: C01 [X(C17H13N3O2)]
dipole: -0.0709566 1.569118 0.5617969 debye
polarizability: 450.2009034|-37.881088|222.4739976|-24.9873268|-6.8345825|158.8420777 unknown
InChI: InChI=1S/C17H13N3O2/c21-20(22)15-10-2-1-7-12(15)17-18-13-8-3-5-11-6-4-9-14(19-17)16(11)13/h1-10,17-19H
charge 0 multiplicity 1
35 atoms
O  4.753793 -1.588267 -0.89507
O  2.592847 -2.225872 -1.243518
N  -0.291118 0.771012 -1.666936
N  -0.053906 -1.393218 -0.675992
N  3.482335 -1.392582 -0.774317
C  0.673351 -0.23773 -1.231755
C  -1.985608 -0.02866 -0.108058
C  -1.514554 0.982518 -1.016448
C  -1.226847 -1.241724 0.062606
C  1.697279 0.318335 -0.202266
C  -3.244341 0.142661 0.572503
C  -2.289948 2.13597 -1.247618
C  -1.714955 -2.254351 0.914108
C  3.016687 -0.202131 -0.038291
C  -4.001854 1.337328 0.332003
C  -3.707282 -0.902676 1.438138
C  1.348514 1.427764 0.610653
C  -3.530992 2.300793 -0.56765
C  -2.95286 -2.07283 1.592332
C  3.950349 0.371435 0.861908
C  2.252906 1.984128 1.537218
C  3.564841 1.461762 1.65798
H  1.228942 -0.591915 -2.11636
H  0.014297 1.440583 -2.371428
H  0.511797 -2.240665 -0.596321
H  -1.939585 2.905566 -1.945846
H  -1.14278 -3.179231 1.050096
H  -4.957469 1.476031 0.849282
H  -4.660017 -0.778857 1.964321
H  0.353313 1.867167 0.499408
H  -4.119687 3.205656 -0.756189
H  -3.314176 -2.871111 2.250536
H  4.95342 -0.059179 0.921765
H  1.940889 2.832267 2.15582
H  4.27482 1.899421 2.36669
