program: Gaussian 09
title: 000256651
version: EM64L-G09RevD.01
frameworkgroup: C1[X(C12H14N2O2)]
method: RPBEPBE
basis: SDD
operation: Freq
keyword: #p
keyword: freq=noraman
keyword: PBEPBE/SDD
title: #p freq=noraman PBEPBE/SDD
converged: NO YES NO NO
title: Mulliken charges:
elementType: O O N N C C C C C C C C C C C C H H H H H H H H H H H H H H
charge: -0.244240 -0.244314 -0.135963 -0.136081 -0.023716 -0.023650 -0.474276 -0.474335 0.330053 0.330668 -0.702185 -0.702236 0.069566 0.069305 -0.519808 -0.520602 0.259426 0.259542 0.241310 0.245683 0.241292 0.245694 0.211402 0.218730 0.263859 0.218715 0.263805 0.211425 0.260455 0.260475
chargesum: 0.00000
title: Mulliken charges with hydrogens summed into heavy atoms:
elementType: O O N N C C C C C C C C C C C C
charge: -0.244240 -0.244314 -0.135963 -0.136081 0.235710 0.235892 0.012718 0.012651 0.330053 0.330668 -0.008193 -0.008290 0.069566 0.069305 -0.259354 -0.260127
polarizability: 2.87147573e+02 2.00502701e+01 1.46573284e+02 -7.55266548e-03 -5.10469733e-04 8.45168490e+01
1716.lowfreq: -4.0120 -0.0005 -0.0002 0.0006 4.3570 15.9782 37.8915 65.7835 66.6025
frequency: 37.8811 65.7780 66.5927 83.5568 111.5146 128.3360 128.5200 194.4131 194.8528 213.1437 218.3855 228.0126 278.2378 322.2424 353.0426 389.3990 392.0944 417.4412 435.3916 454.3141 478.5607 485.0908 579.0047 604.9296 657.6376 731.5766 749.7700 774.2635 776.5225 785.7095 839.4139 852.6915 853.6642 884.8728 895.0550 901.9547 974.4196 988.0947 1018.7997 1018.9415 1080.0929 1080.4991 1097.7826 1103.4226 1122.9635 1125.7453 1151.2643 1151.9983 1185.9018 1187.4061 1209.3489 1241.3085 1300.9701 1336.3350 1349.9310 1352.6268 1389.4121 1390.5061 1431.9543 1434.0739 1459.2261 1459.2962 1470.7014 1471.2571 1480.5256 1480.9621 1530.3006 1554.7314 1593.4689 1620.0739 2992.0250 2992.1386 3061.9191 3062.0709 3085.3201 3085.3625 3096.2564 3096.3046 3108.6138 3108.7336 3149.3478 3151.5931 3171.1283 3171.1691
redmass: 4.3943 3.5197 4.5242 3.5562 3.5893 4.5999 3.1996 2.6687 4.6841 1.1202 1.3273 4.1123 3.4278 5.0924 7.2694 2.4238 2.4851 4.4951 3.5164 4.3253 7.0884 5.4819 5.3595 5.7927 4.8941 7.5512 2.2526 3.5377 3.0064 2.7355 2.3978 2.0463 1.5457 1.4552 1.3137 2.0164 3.8895 3.9020 1.2191 1.1616 1.4588 1.4691 1.4020 1.3587 1.4711 1.4752 1.8910 1.9062 2.4129 2.4507 1.4072 5.8349 1.5711 2.4127 2.4155 1.7229 1.2672 1.2730 2.7335 2.7269 1.0505 1.0517 1.4109 1.3910 1.0712 1.0830 9.2018 9.1041 9.9089 7.6798 1.0356 1.0355 1.0538 1.0538 1.0950 1.0951 1.0971 1.0972 1.0973 1.0972 1.0911 1.0915 1.1164 1.1164
irintensity: 5.1129 2.5510 3.8745 1.2212 0.0399 2.8575 8.4279 3.2393 5.6289 0.3620 1.1106 0.2400 47.9354 1.7628 9.2869 0.3803 4.8106 0.2533 0.2140 1.9394 25.5916 1.9172 19.4362 3.1092 0.1703 4.6746 3.9585 2.4833 16.8102 2.9420 3.1331 1.2333 71.2593 49.5053 0.9874 5.0313 0.2592 55.9117 5.6743 26.9263 5.0070 7.8020 7.0242 19.9884 1.7674 6.9507 6.3529 52.0995 128.2795 0.9444 0.0614 143.8178 64.1453 0.6002 0.5170 12.3445 16.0420 37.4036 0.9692 264.6594 0.4970 22.7779 0.0321 184.3724 19.8633 2.2246 0.0816 572.9423 818.4392 0.3139 61.0696 2.6937 59.6732 5.6385 2.6429 8.0475 27.5916 20.8364 37.9469 13.1518 11.8141 0.1370 8.4990 22.4680
temp: 298.150 k
press: 1.00000 atm
elementType: 8 8 7 7 6 6 6 6 6 6 6 6 6 6 6 6 1 1 1 1 1 1 1 1 1 1 1 1 1 1
symmnumber: 1
zpe: 620504.1 jmol-1
zpe.correction: 0.236338 hartree
zpe.thermalcorrener: 0.252137 hartree
zpe.thermalcorrenthalpy: 0.253081 hartree
zpe.thermalcorrgfe: 0.192998 hartree
zpe.sumelectzpe: -724.344415 hartree
zpe.sumelectthermal: -724.328616 hartree
zpe.sumelectthermalent: -724.327672 hartree
zpe.sumelectthermalfe: -724.387755 hartree
dipole: 0.0002 -0.0020 1.9922
dipole: 1.9922
quadrupole: -69.2570 -100.3432 -93.4398
quadrupole: -16.7023 0.0128 0.0172
quadrupole: 18.4230 -12.6632 -5.7598 -16.7023 0.0128 0.0172
hfenergy: -724.5807526 hartree
pointgroup: C01 [X(C12H14N2O2)]
dipole: 0.0000363 -0.0004996 0.783798 debye
polarizability: 286.5833922|21.9318101|147.1374561|-0.0067533|-0.0232592|84.5168574 unknown
InChI: InChI=1S/C12H14N2O2/c1-7-5-13(7)9-3-12(16)10(4-11(9)15)14-6-8(14)2/h3-4,7-8H,5-6H2,1-2H3
charge 0 multiplicity 1
30 atoms
O  1.819577 2.065613 0.110895
O  -1.819515 -2.065217 0.115541
N  2.753564 -0.530234 -0.099052
N  -2.753618 0.530522 -0.099401
C  3.923736 0.016359 0.615154
C  -3.923955 -0.016381 0.614284
C  3.673577 -1.507662 0.513853
C  -3.67383 1.507689 0.513634
C  1.401632 -0.331053 0.016745
C  -1.401722 0.331254 0.01666
C  4.994538 0.722986 -0.191822
C  -4.994471 -0.722768 -0.193274
C  0.948163 1.128338 0.053168
C  -0.94827 -1.128192 0.051583
C  0.478912 -1.370588 0.037261
C  -0.478991 1.370779 0.03743
H  3.698398 0.471415 1.58927
H  -3.698901 -0.471769 1.588317
H  4.281964 -2.099102 -0.179566
H  3.32006 -2.043299 1.405314
H  -4.282086 2.099363 -0.1797
H  -3.320549 2.043003 1.405382
H  5.944645 0.755975 0.371629
H  5.170834 0.209981 -1.153125
H  4.667763 1.7557 -0.401785
H  -5.170515 -0.209408 -1.154433
H  -4.667552 -1.755373 -0.403544
H  -5.944743 -0.756032 0.369885
H  0.803352 -2.416632 0.034544
H  -0.803399 2.416833 0.034149
