program: Gaussian 09
title: 000023179
version: EM64L-G09RevD.01
frameworkgroup: C1[X(C10H3Cl3N2)]
method: RPBEPBE
basis: SDD
operation: Freq
keyword: #p
keyword: freq=noraman
keyword: PBEPBE/SDD
title: #p freq=noraman PBEPBE/SDD
converged: YES YES NO NO
title: Mulliken charges:
elementType: Cl Cl Cl N N C C C C C C C C C C H H H
charge: 0.036672 0.009495 0.021439 0.023145 0.022863 0.607526 -0.263800 -0.324994 -0.116678 -0.202935 -0.203573 -0.322355 0.347633 -0.234239 -0.235503 0.274082 0.273618 0.287605
chargesum: 0.00000
title: Mulliken charges with hydrogens summed into heavy atoms:
elementType: Cl Cl Cl N N C C C C C C C C C C
charge: 0.036672 0.009495 0.021439 0.023145 0.022863 0.607526 -0.263800 -0.324994 -0.116678 0.071147 0.070045 -0.034750 0.347633 -0.234239 -0.235503
polarizability: 2.19682691e+02 -8.78015569e+00 1.57756842e+02 -1.22443826e+00 9.84308238e+00 8.10104562e+01
1716.lowfreq: -4.3122 -0.0013 -0.0009 -0.0008 0.4737 3.2192 37.0503 49.9618 64.2430
frequency: 37.0354 49.9586 64.2421 93.3118 111.3746 129.6832 187.5143 194.0356 208.3577 223.6213 280.5460 299.9481 309.1036 325.4543 373.9207 425.6376 461.6613 473.4482 521.1965 554.3431 577.0100 590.5986 649.4767 665.2578 715.9007 752.8666 788.1649 813.1967 874.9123 900.3732 949.6589 1059.6173 1129.4342 1143.4082 1172.0434 1229.1547 1322.9188 1357.3095 1363.4865 1423.6184 1545.5027 1574.0788 1601.2041 2181.1848 2186.8771 3131.4796 3170.1079 3188.4737
redmass: 13.7142 14.0418 13.7949 10.0638 15.3608 12.4845 15.8626 28.3118 12.3725 9.7878 8.8618 7.0494 10.5651 6.1570 9.9405 9.2935 10.1257 6.9136 4.8312 6.0202 7.3394 12.1779 6.4341 7.2462 7.4793 8.0227 7.4753 1.3442 2.1308 3.0523 1.3524 7.8357 1.9206 3.4089 2.1672 2.2130 2.6755 2.5677 5.7557 2.7235 7.1323 8.9132 8.5237 12.6232 12.6384 1.0896 1.0895 1.0979
irintensity: 1.4027 0.1317 1.4360 0.9810 0.8977 2.5280 1.0230 0.1747 3.3981 5.7055 1.5081 4.9095 1.0474 1.6264 4.7126 0.7094 4.2338 8.1548 2.1619 12.6555 10.3756 0.0300 2.3755 12.5375 9.9944 23.9600 6.4129 40.8224 12.7333 32.8096 0.0522 34.7170 5.9562 27.4282 33.9300 8.7757 8.5789 5.1109 35.2222 77.0164 15.9130 5.4829 21.1144 0.5474 8.2703 3.8996 0.0332 0.0147
temp: 298.150 k
press: 1.00000 atm
elementType: 17 17 17 7 7 6 6 6 6 6 6 6 6 6 6 1 1 1
symmnumber: 1
zpe: 259480.2 jmol-1
zpe.correction: 0.098831 hartree
zpe.thermalcorrener: 0.112974 hartree
zpe.thermalcorrenthalpy: 0.113918 hartree
zpe.thermalcorrgfe: 0.055859 hartree
zpe.sumelectzpe: -1871.458872 hartree
zpe.sumelectthermal: -1871.444728 hartree
zpe.sumelectthermalent: -1871.443784 hartree
zpe.sumelectthermalfe: -1871.501843 hartree
dipole: -4.6654 2.1889 -1.9097
dipole: 5.4958
quadrupole: -123.2025 -104.3401 -111.8877
quadrupole: -0.7434 -3.8992 -2.6796
quadrupole: -10.0591 8.8033 1.2557 -0.7434 -3.8992 -2.6796
hfenergy: -1871.5577025 hartree
pointgroup: C01 [X(C10H3Cl3N2)]
dipole: -2.0181284 0.4322354 -0.6446152 debye
dipolederiv: -0.1095065 0.1375095 0.0358578 0.068575 -0.5553548 -0.1608938 0.0240545 -0.1747643 -0.0510114 -0.2730175 -0.326805 0.0056459 -0.2452048 -0.4922969 -0.0257643 0.0153093 0.0124164 -0.0219684 -0.4804921 -0.3215401 -0.0306516 -0.3926829 -0.3334177 -0.0339413 -0.0187708 -0.0220743 -0.0137186 -0.240077 -0.0057814 -0.0097766 0.0332214 -0.2005012 0.0137466 0.0325227 0.0108413 -0.1786915 -0.1737596 -0.008501 -0.0095444 -0.0086646 -0.1763413 0.0418133 -0.0747465 0.0476847 -0.1305259 -0.1822557 -0.0295467 0.0529971 -0.0371148 -0.3281748 -0.091624 0.0953207 -0.0837921 -0.0104756 0.0742519 -0.3387602 -0.0945453 -0.2176275 0.7368815 0.2581716 0.0402304 0.2302987 0.0420114 0.3932046 0.5589214 -0.052923 0.2447566 0.7314346 0.0077691 -0.1911796 0.0241938 -0.0547035 0.5843381 0.6045713 0.0563746 0.801005 0.2830609 -0.0019003 0.0751424 -0.0139733 -0.0565848 -0.1999777 -0.1970714 -0.008435 -0.1327276 -0.1165272 0.0332964 0.0369348 0.0461311 -0.0660383 -0.1063045 -0.058143 -0.0348121 -0.1337729 0.011329 0.0286114 -0.0412058 0.0253954 -0.0598784 0.5598109 -0.0254093 0.1343901 0.0605236 -0.0262103 0.0797583 0.0254982 0.0392947 0.0033804 -0.0573558 0.0090061 -0.09103 -0.1084797 0.1944203 0.0449618 -0.1777259 0.051723 0.329986 0.1671637 -0.0301629 -0.0413534 -0.0850575 0.0216873 -0.0486385 -0.0583201 -0.0426077 -0.1035691 -0.0822342 0.0162925 0.0471132 0.039263 0.0583945 -0.0282122 0.1429576 -0.0587168 -0.0015462 0.0765423 0.0013681 0.0080268 0.014997 0.0098208 -0.0367186 0.0317516 -0.0307927 0.1561411 0.0064195 0.0060226 0.0300122 0.0052791 0.0867978 -0.0184758 0.0173562 -0.0267745 0.1521215 0.0432494 0.0080295 0.0026538 0.0937117 0.0949976 -0.0619596 0.0248703 -0.0344834 0.0650712 unknown
polarizability: 218.682973|12.613832|147.8581914|-1.6066954|28.3412546|91.9088255 unknown
InChI: InChI=1S/C10H3Cl3N2/c11-8-1-2-9(12)10(13)7(8)3-6(4-14)5-15/h1-3H
charge 0 multiplicity 1
18 atoms
Cl -0.907369 -2.553209 -1.000646
Cl 0.350233 2.814856 -0.018823
Cl -4.015611 -1.882808 -0.312417
N  4.498285 -0.734012 -0.953887
N  2.124562 0.890163 2.450123
C  -0.386898 0.119385 -0.412297
C  -1.400335 -0.882313 -0.511201
C  -0.812231 1.423253 -0.029981
C  -2.746835 -0.605061 -0.204697
C  -2.155609 1.710578 0.277858
C  -3.124795 0.692195 0.198885
C  0.998927 -0.238389 -0.776531
C  2.131662 -0.038407 -0.01747
C  3.425066 -0.42123 -0.530359
C  2.11524 0.488998 1.32414
H  -2.443494 2.724215 0.566701
H  -4.170275 0.902441 0.439564
H  1.130876 -0.753456 -1.736362
