program: Gaussian 09
title: 000256604
version: EM64L-G09RevD.01
frameworkgroup: C1[X(C16H18O6)]
method: RPBEPBE
basis: SDD
operation: Freq
keyword: #pfreq=noraman
keyword: PBEPBE/SDD
title: #p freq=noraman PBEPBE/SDD
converged: YES YES NO NO
title: Mulliken charges:
elementType: O O O O O O C C C C C C C C C C C C C C C C H H H H H H H H H H H H H H H H H H
charge: -0.281265 -0.281157 -0.343685 -0.343507 -0.453985 -0.454049 0.434564 0.434619 -0.557813 -0.557859 -0.566831 -0.566895 0.260896 0.261012 0.277617 0.277577 -0.041323 -0.041401 -0.498934 -0.498975 -0.520008 -0.520034 0.249543 0.249571 0.269256 0.269234 0.387344 0.387329 0.223423 0.233875 0.233338 0.233427 0.233792 0.223391 0.229231 0.223035 0.241700 0.223000 0.241691 0.229255
chargesum: 0.00000
title: Mulliken charges with hydrogens summed into heavy atoms:
elementType: O O O O O O C C C C C C C C C C C C C C C C
charge: -0.281265 -0.281157 -0.343685 -0.343507 -0.066641 -0.066721 0.434564 0.434619 -0.308270 -0.308287 -0.297575 -0.297661 0.260896 0.261012 0.277617 0.277577 -0.041323 -0.041401 0.191702 0.191635 0.173958 0.173913
polarizability: 3.15188522e+02 2.45274569e-03 2.31536020e+02 1.97690378e+00 -1.04368878e-03 1.10908815e+02
1716.lowfreq: -47.5048 -46.9758 -5.5453 -1.4048 -0.0007 -0.0006 -0.0005 7.2753 25.3823
frequency: -47.4769 -46.9544 25.3440 50.8659 58.9617 69.0257 70.5566 128.0032 138.8794 152.7239 169.5580 175.6182 184.2124 196.9745 200.6215 214.2042 226.2297 240.8188 261.5258 266.8548 278.9481 301.1970 315.9234 318.8667 335.1541 373.3881 392.8627 406.3394 464.3152 467.2960 488.5466 489.1553 520.5983 521.9573 562.5496 563.4148 574.9656 632.5643 634.5077 664.6821 687.8972 717.6627 717.7567 752.3393 806.2491 813.1532 829.9538 863.1047 863.8084 867.9166 884.0571 910.6781 985.1444 1025.9239 1061.5301 1072.7558 1080.9754 1108.4087 1108.4442 1118.0196 1118.1325 1135.5038 1153.9290 1158.9068 1163.5239 1163.5934 1175.6713 1212.6740 1213.8856 1231.5214 1261.5537 1284.1000 1287.2150 1340.8456 1378.9453 1414.8893 1420.2106 1426.0869 1440.3160 1445.4082 1452.8510 1455.0112 1456.6530 1456.8010 1463.5536 1463.9822 1464.7197 1464.7700 1470.4868 1475.9431 1486.9931 1509.2201 1598.1821 1605.1006 1613.9252 1619.2935 2966.1046 2966.4997 2997.9399 2998.2484 3055.9747 3056.0716 3103.8461 3104.1150 3124.0657 3124.3049 3125.4550 3125.6258 3159.6531 3163.0314 3167.0394 3170.7023 3478.8499 3479.5828
redmass: 2.9909 2.9677 4.6575 6.3313 4.9772 3.2960 3.5137 5.1387 3.3869 3.8578 2.7212 1.3719 1.4256 1.6445 2.6674 1.8420 2.4952 4.2999 2.0057 2.8424 2.9008 4.9067 5.6180 5.5393 5.4420 6.0195 4.6644 4.6279 6.3901 6.7232 1.1264 1.1286 6.0718 6.2211 4.9762 4.5469 4.9569 5.2728 7.0752 4.1930 4.3193 3.0394 3.1837 6.1005 6.1736 1.6052 1.6118 3.3928 5.3974 1.8564 1.7163 6.8138 8.5613 4.8833 2.4387 4.9446 3.3721 1.2485 1.2485 1.2553 1.2557 3.2049 1.4028 1.5225 1.4624 1.4531 2.7701 1.6148 1.8578 1.7565 3.5682 1.5495 1.4251 5.7748 3.6345 3.3531 2.3668 2.1251 1.2837 1.2517 1.6230 1.8145 1.0511 1.0512 1.0688 1.0507 1.0515 1.0505 1.4628 1.0969 1.7852 4.1753 6.2696 7.3096 6.5727 7.2354 1.0322 1.0323 1.0287 1.0287 1.1043 1.1043 1.1048 1.1048 1.1051 1.1051 1.1004 1.1004 1.0911 1.0902 1.0917 1.0911 1.0640 1.0641
irintensity: 12.2864 3.1989 0.3194 0.3299 0.0756 7.3634 0.7821 0.6367 4.4898 4.3995 1.8856 0.0340 0.7291 0.0767 0.6653 1.5382 1.0370 6.1374 0.2337 0.2289 0.0676 0.4248 25.2953 0.0623 4.4235 0.0001 8.4117 6.0039 7.0042 1.1597 35.4413 224.1071 4.1455 4.4175 0.7001 0.5469 22.9427 0.4460 54.7138 1.9455 8.2679 0.6142 2.3250 4.3312 6.2330 59.4794 5.9389 60.7910 14.9442 54.7930 4.6609 0.0017 30.1283 3.1927 51.6450 321.2001 37.6459 0.0939 0.1077 0.1876 0.2998 26.9974 0.7264 15.0331 52.1617 16.6811 181.4259 123.7422 45.4270 86.3956 587.3412 117.8927 96.9213 5.2726 53.1488 6.9715 69.4095 14.5379 69.5119 0.0507 7.1151 38.0098 10.0876 11.9529 64.6181 53.1643 19.8147 6.0866 240.3902 39.9707 149.1847 3.1323 218.1156 22.1201 27.5738 45.5448 12.3194 96.2745 113.2865 45.6794 16.9026 69.2690 33.0065 40.1849 22.4766 31.5188 33.1467 17.6772 2.2305 9.0643 1.1508 0.1803 130.7261 89.1538
temp: 298.150 k
press: 1.00000 atm
elementType: 8 8 8 8 8 8 6 6 6 6 6 6 6 6 6 6 6 6 6 6 6 6 1 1 1 1 1 1 1 1 1 1 1 1 1 1 1 1 1 1
symmnumber: 1
zpe: 815048.7 jmol-1
zpe.correction: 0.310436 hartree
zpe.thermalcorrener: 0.331643 hartree
zpe.thermalcorrenthalpy: 0.332588 hartree
zpe.thermalcorrgfe: 0.260697 hartree
zpe.sumelectzpe: -1070.139243 hartree
zpe.sumelectthermal: -1070.118035 hartree
zpe.sumelectthermalent: -1070.117091 hartree
zpe.sumelectthermalfe: -1070.188982 hartree
dipole: -0.0012 5.8214 0.0045
dipole: 5.8214
quadrupole: -114.2059 -106.0452 -130.2526
quadrupole: 0.0001 -4.4623 -0.0027
quadrupole: 2.6287 10.7893 -13.4180 0.0001 -4.4623 -0.0027
hfenergy: -1070.4496785 hartree
pointgroup: C01 [X(C16H18O6)]
dipole: -0.0342045 2.2889429 -0.0716672 debye
polarizability: 313.0566009|1.8624056|231.4513729|20.7177576|-3.4929161|113.1253832 unknown
InChI: InChI=1S/C16H18O6/c1-19-11-5-9(6-12(20-2)15(11)17)10-7-13(21-3)16(18)14(8-10)22-4/h5-8,17-18H,1-4H3
charge 0 multiplicity 1
40 atoms
O  3.386318 -2.509379 1.326447
O  -3.290801 -2.674191 -0.777436
O  3.760723 2.092224 -0.226922
O  -3.799737 2.004405 0.478166
O  5.005651 -0.045951 0.624286
O  -4.981096 -0.21989 -0.234146
C  0.755033 -0.146607 0.262586
C  -0.72971 -0.172549 0.128791
C  1.490635 1.029353 -0.063849
C  -1.499635 0.999766 0.380677
C  1.459425 -1.284053 0.715757
C  -1.400275 -1.356678 -0.249898
C  2.871245 -1.297359 0.85334
C  -2.811062 -1.419897 -0.384579
C  2.886736 1.016293 0.070196
C  -2.894674 0.937533 0.249225
C  3.60205 -0.127462 0.525324
C  -3.575884 -0.253315 -0.131375
C  4.834016 -2.69501 1.532616
C  -4.732549 -2.913979 -0.968514
C  3.172266 3.318555 -0.760587
C  -3.247442 3.278124 0.933781
H  0.971304 1.905688 -0.46077
H  -1.006452 1.914291 0.720621
H  0.926703 -2.191924 1.011981
H  -0.841044 -2.265945 -0.487318
H  5.260492 0.869593 0.326123
H  -5.263658 0.704955 0.004299
H  4.922207 -3.728239 1.902567
H  5.391219 -2.573595 0.588931
H  5.22626 -1.982941 2.277481
H  -5.145753 -2.262196 -1.756075
H  -5.292939 -2.749644 -0.033227
H  -4.79083 -3.970649 -1.272284
H  2.639276 3.120905 -1.710041
H  2.476693 3.773295 -0.02938
H  4.018543 3.997643 -0.941265
H  -2.563862 3.705951 0.175514
H  -4.113019 3.942722 1.071833
H  -2.710672 3.155056 1.893626
