program: Gaussian 09
title: 000256594
version: EM64L-G09RevD.01
frameworkgroup: C1[X(C9H19NO2)]
method: RPBEPBE
basis: SDD
operation: Freq
keyword: #p
keyword: freq=noraman
keyword: PBEPBE/SDD
title: #p freq=noraman PBEPBE/SDD
converged: YES YES NO NO
title: Mulliken charges:
elementType: O O N C C C C C C C C C H H H H H H H H H H H H H H H H H H H
charge: -0.263388 -0.243395 -0.096384 -0.345104 -0.507231 -0.351275 -0.341578 -0.298610 0.243143 -0.691870 -0.616057 -0.613640 0.200818 0.220509 0.237359 0.242225 0.220262 0.219183 0.193612 0.192445 0.238001 0.230444 0.210947 0.213271 0.216236 0.227314 0.190804 0.223558 0.223555 0.194593 0.230252
chargesum: 0.00000
title: Mulliken charges with hydrogens summed into heavy atoms:
elementType: O O N C C C C C C C C C
charge: -0.263388 -0.243395 -0.096384 0.076223 -0.027647 0.088170 0.044479 0.169835 0.243143 -0.051416 0.025619 0.034761
polarizability: 1.45401385e+02 -8.53458559e-01 1.00888269e+02 5.26206060e-01 -3.21071939e+00 9.24705501e+01
1716.lowfreq: -16.1726 -5.7273 -0.0007 -0.0007 0.0001 6.3019 20.7269 26.3430 41.0053
frequency: 15.5731 25.4671 40.7719 45.9406 78.8968 89.3668 117.0479 119.1832 187.1906 205.8221 229.4119 235.0773 257.1499 263.3388 310.8148 348.0802 369.7611 411.7844 439.4283 493.9706 576.9161 657.8210 727.8573 789.4304 793.2610 812.2885 843.1982 904.4135 921.1684 935.8120 1029.1140 1035.3351 1036.5266 1065.9546 1073.6653 1082.1753 1089.9253 1094.1233 1107.9974 1139.2352 1139.5153 1186.4255 1206.8928 1257.5345 1260.9021 1270.4382 1274.8378 1289.0402 1299.9825 1323.9509 1335.5100 1362.0755 1378.7328 1392.0793 1420.9982 1440.9321 1441.6949 1450.4191 1461.2777 1468.1368 1468.5761 1474.8866 1476.8372 1477.4232 1480.1372 1486.1133 1488.6199 1640.2575 2856.2102 2868.1075 2895.4597 2963.6498 2974.7860 2978.0203 2991.6008 3007.9088 3018.9171 3028.0678 3037.1329 3039.5998 3045.1815 3062.3025 3073.4463 3074.2342 3077.8258 3087.8496 3126.4505
redmass: 2.9301 3.7293 4.5552 1.7492 2.8396 2.7693 2.3601 2.5013 1.7080 1.2606 1.1534 1.9031 2.0644 2.6776 4.0897 2.7386 3.0180 2.5497 2.5961 3.2611 3.4203 4.1359 1.1063 1.2568 1.4018 4.8181 3.2650 1.7902 1.2921 6.8629 2.4586 3.1878 1.5783 2.0265 2.0929 2.0995 1.3354 2.2599 1.9427 1.4976 2.7088 1.6695 1.4497 1.5176 1.4286 2.3382 1.2179 1.0682 1.2078 1.3260 1.5458 1.6773 1.3564 1.2195 1.1397 1.1266 1.1012 1.1042 1.0511 1.0565 1.0675 1.0519 1.0664 1.0419 1.0885 1.0543 1.0826 9.2119 1.0565 1.0573 1.0687 1.0591 1.0370 1.0643 1.0618 1.0986 1.0731 1.0733 1.0660 1.0967 1.0839 1.1002 1.1007 1.0995 1.1007 1.1007 1.1073
irintensity: 0.1361 0.3935 2.1260 0.2551 0.9127 0.5683 0.2729 1.3792 1.7743 2.3463 0.0886 1.9332 1.1556 4.3925 9.7843 16.3117 8.9815 4.3830 3.3411 4.9676 4.1669 5.8639 13.5753 1.5138 6.0123 4.5599 8.9601 13.2773 5.6410 57.8936 18.7831 48.4338 21.5025 4.3850 56.8966 2.7399 10.8473 78.0752 4.3242 6.2790 211.0686 3.5557 4.6335 6.9310 41.8484 12.4624 12.9346 1.0429 0.8832 5.4135 30.8485 4.3558 12.1593 15.0021 2.3232 5.9267 17.7864 6.3752 15.7826 6.0516 1.1000 26.2890 4.0675 12.6603 18.0665 10.0012 20.2926 142.7275 85.2166 133.4423 96.7645 31.9540 34.2872 0.9872 42.9047 11.4013 45.0716 30.5634 41.6198 1.7650 19.4996 6.3314 98.2441 57.4642 33.6449 40.2634 17.2757
temp: 298.150 k
press: 1.00000 atm
elementType: 8 8 7 6 6 6 6 6 6 6 6 6 1 1 1 1 1 1 1 1 1 1 1 1 1 1 1 1 1 1 1
symmnumber: 1
zpe: 710948.3 jmol-1
zpe.correction: 0.270786 hartree
zpe.thermalcorrener: 0.286443 hartree
zpe.thermalcorrenthalpy: 0.287387 hartree
zpe.thermalcorrgfe: 0.224818 hartree
zpe.sumelectzpe: -558.538848 hartree
zpe.sumelectthermal: -558.523190 hartree
zpe.sumelectthermalent: -558.522246 hartree
zpe.sumelectthermalfe: -558.584815 hartree
dipole: 0.1777 -0.6870 1.2832
dipole: 1.4663
quadrupole: -66.5853 -78.1477 -74.4313
quadrupole: 3.9895 1.9960 1.3558
quadrupole: 6.4695 -5.0929 -1.3765 3.9895 1.9960 1.3558
hfenergy: -558.8096334 hartree
pointgroup: C01 [X(C9H19N1O2)]
dipole: 0.078111 0.5542253 -0.1398304 debye
polarizability: 145.4218231|0.2633663|99.4568506|0.1957806|4.4892834|93.8815303 unknown
InChI: InChI=1S/C9H19NO2/c1-4-5-6-9(11)12-8-7-10(2)3/h4-8H2,1-3H3
charge 0 multiplicity 1
31 atoms
O  0.297332 0.68917 1.230721
O  -0.434272 -1.240393 0.137856
N  3.78742 0.04946 -0.098962
C  -3.084804 -0.035179 -0.224653
C  -2.053527 0.523784 0.777233
C  2.411163 0.593733 -0.0750
C  -4.497193 0.547219 0.004415
C  1.69431 0.162045 1.218527
C  -0.685235 -0.125627 0.651975
C  -5.531354 0.005946 -1.006017
C  4.746112 0.902566 -0.828189
C  3.846664 -1.35853 -0.545824
H  -2.754548 0.188069 -1.258473
H  -3.112023 -1.138014 -0.141635
H  -2.406133 0.351326 1.815393
H  -1.936989 1.618182 0.675423
H  1.807015 0.270813 -0.95706
H  2.462915 1.697304 -0.09628
H  -4.457769 1.653826 -0.062562
H  -4.828423 0.309071 1.036257
H  2.175159 0.610985 2.100175
H  1.661724 -0.936755 1.314381
H  -5.24407 0.261996 -2.04322
H  -5.60691 -1.095842 -0.942501
H  -6.536877 0.425835 -0.820189
H  4.737136 1.923155 -0.40648
H  4.535191 0.976589 -1.925291
H  5.766418 0.494851 -0.70856
H  4.866456 -1.753829 -0.390393
H  3.584165 -1.482875 -1.626646
H  3.149149 -1.97938 0.041275
