program: Gaussian 09
title: 000264684
version: EM64L-G09RevD.01
frameworkgroup: C1[X(C10H10O2)]
method: RPBEPBE
basis: SDD
operation: Freq
keyword: #pfreq=noraman
keyword: PBEPBE/SDD
title: #p freq=noraman PBEPBE/SDD
converged: YES YES NO NO
title: Mulliken charges:
elementType: O O C C C C C C C C C C H H H H H H H H H H
charge: -0.253493 -0.417745 0.203734 0.153862 0.082582 0.217496 -0.442251 0.182596 -0.810021 -0.799140 -0.203360 -0.387867 0.238622 0.231913 0.235646 0.235637 0.259350 0.238847 0.238836 0.220277 0.216291 0.358189
chargesum: 0.00000
title: Mulliken charges with hydrogens summed into heavy atoms:
elementType: O O C C C C C C C C C C
charge: -0.253493 -0.059556 0.203734 0.153862 0.082582 0.217496 -0.203630 0.182596 -0.106826 -0.062107 0.016917 -0.171576
polarizability: 1.59559161e+02 5.77360916e+00 1.27062620e+02 2.10954324e-03 1.73382918e-03 5.59069049e+01
1716.lowfreq: -93.3843 -2.9935 -0.0005 -0.0005 0.0003 3.6299 11.6055 113.2098 121.8978
frequency: -93.3453 113.2042 121.8923 132.8041 192.8846 225.5587 230.1418 310.0914 322.4765 334.5036 347.5684 456.2045 538.6615 546.0147 554.6634 564.4251 578.1971 632.4000 681.4452 721.7024 773.2638 792.6729 831.2791 845.4377 931.1171 946.1826 968.6568 1035.0376 1046.5431 1052.1243 1088.4234 1139.4213 1160.8170 1171.0667 1229.4765 1253.8257 1266.0074 1365.3324 1400.8793 1405.3852 1421.5226 1448.0087 1462.7775 1465.5328 1473.8451 1475.4236 1482.4101 1592.8465 1636.8596 1648.6306 2970.5748 2984.1214 3043.9999 3059.5912 3081.9638 3104.8689 3116.4881 3140.8922 3163.7674 3581.2536
redmass: 1.0203 2.4789 1.4754 2.3326 3.9080 4.2518 2.6006 2.5920 4.2757 4.1367 1.3692 6.1912 4.7387 4.1687 4.0674 4.6855 5.5953 4.5268 6.0602 1.8725 2.4180 4.1738 5.9203 1.4123 2.3364 1.2974 2.2720 1.3859 1.4998 2.1381 1.9540 2.3275 1.6185 1.8230 2.2588 3.3249 1.8238 2.6194 1.4748 1.2414 4.9806 4.0860 1.0445 1.0888 1.0446 1.6574 1.5473 7.4039 7.9705 7.5859 1.0374 1.0380 1.0980 1.0983 1.0977 1.0973 1.0880 1.0896 1.0985 1.0660
irintensity: 0.0203 0.0062 2.3134 10.6230 5.8989 0.1197 1.5660 29.7936 1.0574 3.2188 105.8897 0.4815 0.6498 0.6458 1.4681 0.6201 1.4336 1.4268 8.7648 51.4222 49.4643 2.4983 12.3597 1.4166 42.6556 0.9398 57.5903 5.5899 0.0000 22.9328 97.7476 8.7855 56.8806 29.7650 26.0129 5.4849 80.6950 12.0957 9.3636 12.8657 21.1301 24.3638 29.9659 18.8409 0.0933 29.0939 10.9100 39.8200 16.1111 39.8050 38.7643 28.1358 22.0528 15.5877 20.4063 6.9700 12.6889 12.9142 21.0042 38.1911
temp: 298.150 k
press: 1.00000 atm
elementType: 8 8 6 6 6 6 6 6 6 6 6 6 1 1 1 1 1 1 1 1 1 1
symmnumber: 1
zpe: 452566.2 jmol-1
zpe.correction: 0.172373 hartree
zpe.thermalcorrener: 0.182721 hartree
zpe.thermalcorrenthalpy: 0.183665 hartree
zpe.thermalcorrgfe: 0.136958 hartree
zpe.sumelectzpe: -536.639544 hartree
zpe.sumelectthermal: -536.629197 hartree
zpe.sumelectthermalent: -536.628253 hartree
zpe.sumelectthermalfe: -536.674960 hartree
dipole: -0.0681 1.4046 0.0019
dipole: 1.4062
quadrupole: -49.4704 -69.3479 -73.9638
quadrupole: -1.6935 0.0045 -0.0035
quadrupole: 14.7903 -5.0872 -9.7031 -1.6935 0.0045 -0.0035
hfenergy: -536.8119174 hartree
pointgroup: C01 [X(C10H10O2)]
dipole: -0.0068215 0.5532011 0.0018371 debye
dipolederiv: -0.7815367 0.1099223 -0.0065603 -0.151566 -0.6141673 -0.0026152 -0.0071405 0.0001319 -0.1232492 -0.3025438 0.4269073 0.0022414 0.5962004 -1.2037143 0.0045663 0.0027108 0.0025662 -0.3990685 0.3645594 0.2240218 0.004096 -0.0238159 -0.0613038 -0.0003881 0.0036317 0.0021521 0.015682 -0.1229814 -0.3077226 -0.0007788 -0.2729904 -0.063587 -0.0027154 -0.0007083 -0.0030058 -0.1088977 0.0378536 0.2924377 0.0008049 0.5503631 0.0665295 0.0057978 0.0013057 0.0032245 0.0224755 0.5638256 0.0064955 0.0059406 0.0196494 0.5392111 0.001354 0.0057619 0.0010495 -0.0157308 -0.1625831 -0.0498802 0.0004432 -0.0067395 -0.0218006 0.0003926 0.0005185 -0.0000301 -0.2170041 0.5136265 -0.408851 0.0036495 -0.5753386 1.1544948 -0.0036734 0.0033101 -0.00188 0.0680836 0.0170031 0.0224718 -0.0008547 0.0259168 0.0237337 0.0001385 -0.0008331 0.0000336 0.1024958 -0.1545567 -0.0862896 -0.0026058 -0.0327693 -0.0104713 -0.0005343 -0.002291 -0.0009813 0.0808229 0.1030748 0.0193046 0.0026521 -0.0614392 0.1441518 -0.0000107 0.0024586 0.0008246 -0.1471204 -0.1323825 -0.16672 0.0007972 0.1100788 -0.3299546 0.0009896 0.0013969 -0.0019698 -0.2458608 0.0647521 0.079528 -0.000916 0.0430739 -0.0773215 -0.0001068 -0.0009945 0.0002489 0.1703143 -0.1424653 -0.0160262 -0.0027393 -0.1034923 0.0656624 -0.0012489 -0.0029422 -0.0002689 0.1042866 0.0835583 -0.0059205 -0.0471195 0.0493631 -0.0261893 -0.0968435 0.0070521 -0.13164 -0.0483929 0.082657 -0.0091289 0.0499813 0.0472044 -0.0272557 0.0979735 -0.0039412 0.1315555 -0.0462899 0.1020844 0.0740551 -0.0001074 -0.0079152 -0.0738576 -0.0005561 -0.0003105 0.0002833 0.1306163 -0.0433105 -0.0383214 0.0796554 -0.0089649 0.0737074 -0.0658319 0.1268691 -0.0188542 -0.0330802 -0.0391249 -0.0382723 -0.0800055 -0.0096301 0.073373 0.0661373 -0.1270754 0.0185824 -0.0368329 -0.0257582 -0.1137075 -0.0021798 -0.1118246 -0.0365782 -0.0015897 -0.0021883 -0.0016033 0.1605843 -0.1223351 0.0637512 -0.003007 0.0818824 0.0529303 0.000576 -0.0029609 0.0003888 0.1817448 0.0965832 -0.078055 -0.0033876 -0.1572462 0.3524074 -0.0018117 -0.0036296 -0.0008079 0.3844212 unknown
polarizability: 159.9224855|4.5824554|126.6875351|1.0907583|0.1988323|55.9186651 unknown
InChI: InChI=1S/C10H10O2/c1-6-7(2)12-10-8(6)4-3-5-9(10)11/h3-5,11H,1-2H3
charge 0 multiplicity 1
22 atoms
O  -0.673945 -1.450469 -0.006533
O  2.155949 -2.192521 0.02116
C  -0.100041 0.797828 0.004245
C  -1.556615 0.69515 -0.011147
C  0.393058 -0.536059 0.006518
C  -1.862403 -0.655426 -0.017189
C  0.813578 1.88449 0.01612
C  1.765546 -0.846105 0.020096
C  -2.527007 1.845656 -0.01886
C  -3.144951 -1.427349 -0.031829
C  2.191048 1.587013 0.029782
C  2.666189 0.245549 0.031785
H  0.46231 2.921019 0.014808
H  -3.573121 1.49449 -0.031195
H  -2.397516 2.485868 0.874681
H  -2.377937 2.490286 -0.906137
H  -2.926662 -2.507649 -0.032109
H  -3.766098 -1.202926 0.854807
H  -3.748326 -1.198915 -0.929654
H  2.92415 2.400959 0.039165
H  3.747119 0.053126 0.042543
H  3.142772 -2.263513 0.032049
