program: Gaussian 09
title: 000264683
version: EM64L-G09RevD.01
frameworkgroup: C1[X(C7H7N3)]
method: RPBEPBE
basis: SDD
operation: Freq
keyword: #p
keyword: freq=noraman
keyword: PBEPBE/SDD
title: #p freq=noraman PBEPBE/SDD
converged: NO NO NO NO
title: Mulliken charges:
elementType: N N N C C C C C C C H H H H H H H
charge: -0.204626 -0.112734 -0.058257 0.130683 0.337324 -0.338366 -0.215919 -0.192372 -0.771499 -0.307422 0.245374 0.278165 0.214957 0.248328 0.248344 0.233604 0.264417
chargesum: 0.00000
title: Mulliken charges with hydrogens summed into heavy atoms:
elementType: N N N C C C C C C C
charge: -0.204626 -0.112734 -0.058257 0.130683 0.337324 -0.092993 0.062246 0.041233 -0.059870 -0.043005
polarizability: 1.23188598e+02 -8.04593483e+00 1.08442505e+02 -4.61084761e-03 6.19717473e-03 4.29308819e+01
1716.lowfreq: -7.7039 -6.2203 0.0004 0.0006 0.0009 13.7344 103.9410 171.2323 216.7522
frequency: 103.9038 171.2317 216.7495 251.1402 269.2348 463.9945 497.0054 509.8389 574.1766 600.4911 645.1388 673.1617 755.5568 776.7319 853.0405 873.2138 891.1309 912.8353 952.0218 952.0675 1033.1841 1048.9762 1078.4349 1127.8980 1164.1579 1178.0548 1213.1850 1258.5529 1298.6318 1338.9896 1375.3651 1402.9165 1435.3553 1453.5243 1468.8376 1500.1250 1560.4709 1622.0184 2988.4198 3070.9665 3098.2901 3146.5536 3179.0903 3212.6324 3246.4444
redmass: 1.0411 4.0939 4.4030 3.0355 3.8808 4.7892 5.9130 3.3665 3.6946 5.2908 4.4161 6.4528 2.5009 1.9041 4.9902 1.3568 1.3178 10.5388 1.3171 2.1872 2.7903 1.5191 1.6672 2.9158 1.9978 1.6195 6.5298 2.7816 2.5029 2.3636 2.2118 1.2579 2.6830 1.0440 1.4129 3.1751 6.0261 6.9209 1.0361 1.0970 1.1009 1.0905 1.0918 1.0989 1.0984
irintensity: 0.8457 2.3009 2.8083 1.0054 4.0455 3.1450 1.7053 1.6731 2.2157 0.3334 6.0806 1.2632 42.5250 39.8280 0.4212 21.9073 0.0865 2.1239 1.0567 4.4521 1.2798 9.0212 7.1719 22.0535 31.5322 5.4891 21.0496 14.6906 39.1608 19.7038 4.5553 18.7868 3.4695 14.2301 3.0049 37.7946 9.6917 11.9232 17.2975 11.2738 17.8963 10.0925 5.5287 2.2377 2.6368
temp: 298.150 k
press: 1.00000 atm
elementType: 7 7 7 6 6 6 6 6 6 6 1 1 1 1 1 1 1
symmnumber: 1
zpe: 343589.9 jmol-1
zpe.correction: 0.130866 hartree
zpe.thermalcorrener: 0.138547 hartree
zpe.thermalcorrenthalpy: 0.139491 hartree
zpe.thermalcorrgfe: 0.098458 hartree
zpe.sumelectzpe: -434.476999 hartree
zpe.sumelectthermal: -434.469319 hartree
zpe.sumelectthermalent: -434.468375 hartree
zpe.sumelectthermalfe: -434.509408 hartree
dipole: -2.8816 1.6745 -0.0017
dipole: 3.3328
quadrupole: -54.4734 -55.4509 -60.7006
quadrupole: -1.4865 -0.0065 -0.0004
quadrupole: 2.4016 1.4241 -3.8256 -1.4865 -0.0065 -0.0004
hfenergy: -434.6078659 hartree
pointgroup: C01 [X(C7H7N3)]
dipole: 1.1880324 -0.5549002 -0.0006594 debye
dipolederiv: 0.0598134 -0.0674589 -0.0004458 0.3206707 -0.3178384 0.0003679 -0.0000364 -0.0000015 0.0850575 -0.787935 0.0084502 0.0001902 0.1798308 -0.4505507 0.0002507 -0.0002916 -0.0003209 -0.2404597 -0.3312892 0.0959422 -0.0001499 -0.0755033 -0.3818225 -0.0004839 0.0004171 0.000531 -0.2000447 0.2491325 -0.3358794 -0.0000296 -0.538559 0.2309387 0.0001585 0.0001617 -0.0001457 0.0315425 0.0129498 0.2394834 0.0001617 0.2095385 0.3390097 0.0000087 -0.0000225 0.0001146 0.0080521 0.0725124 0.096253 -0.0000057 -0.1145425 -0.0681924 0.0001272 0.0000351 -0.0001198 -0.1645978 0.144498 0.0177439 0.0001491 -0.1340223 0.0711672 -0.0001787 -0.0002736 -0.0001647 -0.1049315 -0.026924 -0.1137989 -0.000126 0.040824 0.0259645 -0.0000361 0.0002114 0.0001192 -0.1620633 0.0964269 0.0056246 -0.0000157 -0.0876435 -0.1927038 -0.0000439 -0.0001201 0.0000278 0.0448704 0.4909044 0.045222 0.0003052 0.101759 0.4338091 -0.0002254 -0.0007022 0.0002076 -0.0590803 -0.092317 -0.0217877 0.0000131 -0.0385686 0.0919483 0.0000035 0.0000209 -0.0000385 0.1602493 0.0667088 -0.0452635 0.000031 -0.0067673 0.0309702 0.0000074 -0.0000155 0.0000518 0.195333 -0.156204 -0.0506173 0.0000587 0.0576305 0.0693656 -0.0000228 0.0000718 0.0000162 0.1101652 0.0746255 0.0042354 0.0736234 -0.0122197 0.0265381 -0.0679143 0.0288522 -0.1018796 -0.0202392 0.0745829 0.0043378 -0.0736817 -0.0121496 0.0264735 0.0679203 -0.0288996 0.1018992 -0.0200827 0.0535153 0.0829249 -0.0000072 0.06958 -0.0362682 -0.0000162 -0.0000447 0.0000255 0.1696649 -0.0010006 0.0345884 -0.0000708 0.0401421 0.1011913 0.0000773 0.0006359 -0.0003222 0.1665644 unknown
polarizability: 124.5025043|-6.605735|107.1285986|0.0051459|-0.0057606|42.9308819 unknown
InChI: InChI=1S/C7H7N3/c1-6-3-2-4-10-7(6)8-5-9-10/h2-5H,1H3
charge 0 multiplicity 1
17 atoms
N  -0.712606 -0.749296 -0.000068
N  -1.168893 1.471386 0.000157
N  -2.109254 -0.674035 0.00126
C  -0.149097 0.556031 0.000005
C  1.27122 0.706672 -0.000072
C  2.033667 -0.471503 -0.000342
C  0.038494 -1.905586 -0.000223
C  1.422198 -1.770643 -0.000421
C  1.862026 2.096829 0.000054
C  -2.302751 0.685252 -0.001377
H  3.126467 -0.398331 -0.000375
H  -0.507845 -2.849233 0.000049
H  2.964653 2.061033 -0.000265
H  1.522198 2.664734 0.885086
H  1.521691 2.665122 -0.88453
H  2.039764 -2.672202 -0.000391
H  -3.310631 1.093767 -0.001147
