program: Gaussian 09
title: 000264682
version: EM64L-G09RevD.01
frameworkgroup: C1[X(C7H7N3)]
method: RPBEPBE
basis: SDD
operation: Freq
keyword: #p
keyword: freq=noraman
keyword: PBEPBE/SDD
title: #p freq=noraman PBEPBE/SDD
converged: NO NO NO NO
title: Mulliken charges:
elementType: N N N C C C C C C C H H H H H H H
charge: -0.290631 -0.056452 -0.114662 0.375833 0.226569 -0.374364 -0.279439 -0.751503 -0.160271 -0.310951 0.237128 0.256311 0.255942 0.226373 0.255940 0.240773 0.263405
chargesum: 0.00000
title: Mulliken charges with hydrogens summed into heavy atoms:
elementType: N N N C C C C C C C
charge: -0.290631 -0.056452 -0.114662 0.375833 0.226569 -0.137236 -0.023128 -0.013247 0.080501 -0.047547
polarizability: 1.23332783e+02 7.75534877e+00 1.08556328e+02 2.28670484e-04 2.80482310e-04 4.31008160e+01
1716.lowfreq: -6.1424 0.0004 0.0004 0.0007 7.8141 10.9249 158.6735 170.1499 219.6983
frequency: 158.6595 170.1453 219.6946 267.9754 269.6731 466.6871 497.6372 507.2975 585.4166 612.2982 648.2742 670.1462 749.4096 789.1080 819.0433 873.4024 888.5963 912.2966 960.9056 972.2341 1045.2584 1049.1841 1080.0191 1113.8129 1165.2279 1187.9797 1209.5355 1257.1065 1278.4308 1333.0913 1374.5991 1406.0307 1413.5066 1450.8528 1469.7141 1514.5448 1547.0503 1636.0883 2993.4176 3072.3961 3113.3723 3153.8498 3174.9083 3192.6712 3244.6220
redmass: 1.2926 2.4121 4.2358 3.8238 3.0018 4.5096 5.9415 3.4729 3.7411 5.6502 4.3758 5.9847 2.5266 1.7854 4.8488 1.3702 1.3409 10.9774 1.9909 1.3103 2.7097 1.5214 1.7445 2.7347 2.0615 1.8289 5.9947 2.7242 2.2856 2.3616 2.2506 1.3577 2.5332 1.0434 1.2839 3.5517 7.5805 7.0900 1.0368 1.0967 1.1005 1.0884 1.0940 1.0977 1.0984
irintensity: 1.0290 0.3859 2.9548 4.4176 0.9555 2.9969 1.5872 0.4563 1.0669 0.9098 7.2301 0.4535 25.2384 53.5570 1.7113 20.2865 3.1063 1.6583 3.0475 0.9056 3.8061 8.8173 4.5784 23.4440 35.5194 1.0439 12.4584 34.2858 34.6256 4.7974 3.2581 21.4605 7.2437 15.6456 6.8194 29.4674 49.0086 23.1823 11.5045 7.8815 14.7464 7.7620 6.8274 3.8844 2.7888
temp: 298.150 k
press: 1.00000 atm
elementType: 7 7 7 6 6 6 6 6 6 6 1 1 1 1 1 1 1
symmnumber: 1
zpe: 344023.1 jmol-1
zpe.correction: 0.131031 hartree
zpe.thermalcorrener: 0.138576 hartree
zpe.thermalcorrenthalpy: 0.139520 hartree
zpe.thermalcorrgfe: 0.098970 hartree
zpe.sumelectzpe: -434.479812 hartree
zpe.sumelectthermal: -434.472267 hartree
zpe.sumelectthermalent: -434.471323 hartree
zpe.sumelectthermalfe: -434.511873 hartree
dipole: 3.6767 -0.0886 -0.0006
dipole: 3.6777
quadrupole: -55.5485 -55.0269 -60.6550
quadrupole: 2.9151 0.0015 0.0005
quadrupole: 1.5283 2.0499 -3.5781 2.9151 0.0015 0.0005
hfenergy: -434.6108431 hartree
pointgroup: C01 [X(C7H7N3)]
dipole: -1.4449512 0.0757162 -0.0002393 debye
dipolederiv: -0.3422147 0.1217557 0.000124 0.4514722 -0.1685763 0.0000494 -0.0000243 -0.0000249 0.0730979 -0.4188421 0.1285758 -0.0001053 -0.0543014 -0.3517856 0.0000991 0.0000565 -0.0001477 -0.1844536 -0.7115821 -0.2044967 0.0000256 -0.0658421 -0.5166834 -0.0001004 -0.0001136 0.0001429 -0.2509621 0.2478282 0.0377319 -0.0000547 -0.2169875 0.4996067 0.0000046 0.0000168 0.0000617 0.0276187 0.7169323 0.102694 0.000075 -0.1104083 -0.0129287 0.0000213 0.0000029 0.0000161 0.0531321 0.0054912 -0.1157161 0.0000266 0.1413384 -0.2986682 0.0000363 -0.0000028 -0.0000551 -0.1986267 -0.1896355 0.0133986 -0.0000485 -0.0902689 0.0416648 -0.0000421 0.0000597 -0.0000103 -0.1390565 0.0913733 -0.0446628 0.0000053 0.0832661 -0.206828 -0.0000149 0.0000209 0.000004 0.041869 0.1278596 0.0059223 0.0000401 -0.093899 0.1788033 -0.0000276 -0.0000411 0.0000196 -0.1299917 0.4109277 -0.0167461 -0.000091 0.025874 0.5484129 -0.0000588 0.0002436 0.0000515 -0.064498 -0.0666613 0.0418468 -0.0000099 0.0558191 0.0841646 0.0000042 0.0000018 -0.0000018 0.1681971 0.0761574 0.0531191 -0.0000093 0.0253739 -0.0095986 0.0000056 0.0000272 0.0000112 0.1793682 0.0781206 -0.0174322 -0.0761243 0.0117753 0.0340215 -0.0501212 -0.0409504 -0.0858759 -0.0115088 -0.1359113 0.0639869 -0.0000093 -0.0349007 0.0860752 -0.0000026 -0.0000139 -0.0000001 0.1178877 0.0781186 -0.0174605 0.0761333 0.0117624 0.0339986 0.0501364 0.0409593 0.0858788 -0.0114828 0.0206217 -0.0999657 -0.0000036 -0.0887638 -0.0256892 -0.0000049 -0.0000089 -0.0000016 0.1628287 0.0114166 -0.0525508 0.0000261 -0.0513096 0.0840103 0.0000156 -0.0002338 -0.0000686 0.1665808 unknown
polarizability: 123.7590729|7.3256161|108.1300379|-0.0002365|-0.0002739|43.100816 unknown
InChI: InChI=1S/C7H7N3/c1-6-3-2-4-7-8-5-9-10(6)7/h2-5H,1H3
charge 0 multiplicity 1
17 atoms
N  0.156195 0.475058 0.000031
N  1.171531 1.438692 0.000298
N  2.085339 -0.717802 0.000284
C  -1.204809 0.747222 -0.000037
C  0.720251 -0.832552 0.00003
C  -2.052651 -0.363552 -0.000133
C  -0.158171 -1.946899 -0.000005
C  -1.625403 2.19041 0.000024
C  -1.536179 -1.701428 -0.000113
C  2.29159 0.64485 -0.000345
H  -3.13217 -0.190361 -0.000166
H  0.263146 -2.954534 0.000071
H  -1.220957 2.71543 0.884167
H  -2.724136 2.270261 -0.000034
H  -1.220855 2.715536 -0.884008
H  -2.237447 -2.541693 -0.000127
H  3.281427 1.095659 -0.000238
