program: Gaussian 09
title: 000256583
version: EM64L-G09RevD.01
frameworkgroup: C1[X(C15H13NO4)]
method: RPBEPBE
basis: SDD
operation: Freq
keyword: #p
keyword: freq=noraman
keyword: PBEPBE/SDD
title: #p freq=noraman PBEPBE/SDD
converged: YES YES NO NO
title: Mulliken charges:
elementType: O O O O N C C C C C C C C C C C C C C C H H H H H H H H H H H H H
charge: -0.229164 -0.185435 -0.190624 -0.265725 -0.307903 -0.269201 -0.267252 -0.203083 -0.205139 0.155736 0.124270 -0.216050 -0.214927 0.399005 0.227584 -0.307651 -0.343207 -0.247292 -0.227324 -0.533237 0.289384 0.290634 0.284286 0.282379 0.254620 0.255000 0.254344 0.241003 0.231912 0.226995 0.229976 0.221198 0.244889
chargesum: 0.00000
title: Mulliken charges with hydrogens summed into heavy atoms:
elementType: O O O O N C C C C C C C C C C C C C C C
charge: -0.229164 -0.185435 -0.190624 -0.265725 -0.307903 0.020184 0.023382 0.081203 0.077240 0.155736 0.124270 0.038570 0.040073 0.399005 0.227584 -0.053307 -0.102204 -0.015380 -0.000329 0.162826
polarizability: 2.15380093e+02 -7.35324131e+00 1.69544823e+02 -9.97389965e+00 -2.99297791e+00 1.24210725e+02
1716.lowfreq: -8.7395 -4.8518 -3.8671 -0.0008 -0.0007 0.0004 25.1823 37.4713 66.2838
frequency: 25.1753 37.4566 66.2758 78.6400 92.3463 114.8655 154.3662 167.9901 207.8939 223.5536 237.2700 268.0251 307.7285 312.4045 360.6030 422.7541 458.3039 470.4041 503.2452 516.6367 544.5759 557.9723 584.4015 602.6932 616.0867 644.4843 688.0276 710.8595 734.0836 736.6914 755.4852 775.0325 785.4469 788.4039 816.4803 838.0526 847.7889 880.7577 908.1237 914.4434 932.4695 938.0758 942.7384 965.2024 965.5864 976.2089 988.8349 994.7213 1037.1693 1044.4270 1076.2548 1107.1443 1112.8074 1123.7683 1152.4377 1168.1210 1173.7829 1174.2782 1182.9791 1195.8270 1210.7822 1227.0473 1234.9364 1254.6904 1261.8985 1276.5783 1280.3760 1291.1027 1349.0681 1386.7129 1429.7471 1448.7695 1468.1945 1470.6733 1495.9648 1576.5391 1598.5248 1609.6141 1636.5631 1699.7131 2966.2311 3057.9664 3073.0771 3084.8247 3129.6387 3136.5253 3141.0293 3146.9435 3153.8140 3165.9328 3177.0448 3185.3735 3217.2428
redmass: 4.7537 5.8844 5.0382 6.2231 3.5754 6.2642 7.7026 3.2562 3.9681 3.8429 1.5804 4.4755 4.0812 5.2078 6.5872 4.3591 3.8618 4.3695 4.6957 5.9501 4.1451 5.4303 6.9753 8.9903 4.9257 3.6218 5.3972 2.0905 5.8000 3.9643 1.3515 5.5588 4.4770 5.1376 6.7237 3.0467 1.4848 3.9077 2.0347 1.8696 1.9925 1.5542 3.7016 3.0689 3.7257 1.3314 8.5976 1.8525 2.9047 2.5086 1.3099 2.0953 1.2649 1.4866 1.4778 4.7274 1.1643 1.3947 2.1536 1.2650 1.2985 1.3168 3.5235 1.7649 1.6069 1.5214 1.4298 1.8246 4.7401 10.3957 1.3838 1.8429 1.0503 1.0970 2.6212 6.1176 7.6267 6.6602 12.6419 12.6194 1.0327 1.1041 1.0856 1.0875 1.0998 1.0862 1.0899 1.0954 1.0900 1.0942 1.1004 1.0881 1.1113
irintensity: 0.1091 3.6713 6.1506 0.3105 4.0784 1.4768 4.0573 0.5547 0.5100 1.5880 0.2871 1.2996 1.3870 9.9267 0.5171 0.9120 10.7312 6.6497 4.5676 6.2981 1.4803 3.1936 12.8854 7.5603 11.6171 8.1820 15.4687 48.8005 9.1448 1.8812 86.2852 2.8627 6.4250 15.5975 15.2077 65.2340 3.7996 3.7691 3.3961 0.0754 0.5337 0.4343 59.2030 5.1217 12.0987 1.1948 41.7325 4.2565 9.2064 10.7276 14.3669 30.6913 0.2466 0.2765 8.4787 155.0907 6.8729 20.7034 56.9932 2.1220 13.5716 0.7182 134.9912 5.4990 1.2834 25.4630 1.3439 12.1731 188.9385 26.9502 14.8360 21.2915 12.2344 58.7019 92.8818 2.0984 8.4002 40.0436 496.8700 10.3786 65.7487 37.4339 3.3945 5.8825 19.7301 2.3548 12.8220 1.5871 12.3828 17.7467 11.4070 1.3269 8.2670
temp: 298.150 k
press: 1.00000 atm
elementType: 8 8 8 8 7 6 6 6 6 6 6 6 6 6 6 6 6 6 6 6 1 1 1 1 1 1 1 1 1 1 1 1 1
symmnumber: 1
zpe: 657059.7 jmol-1
zpe.correction: 0.250261 hartree
zpe.thermalcorrener: 0.266467 hartree
zpe.thermalcorrenthalpy: 0.267411 hartree
zpe.thermalcorrgfe: 0.205413 hartree
zpe.sumelectzpe: -933.578453 hartree
zpe.sumelectthermal: -933.562247 hartree
zpe.sumelectthermalent: -933.561303 hartree
zpe.sumelectthermalfe: -933.623301 hartree
dipole: -0.0496 2.9927 1.5305
dipole: 3.3617
quadrupole: -84.9038 -109.3631 -123.4540
quadrupole: -1.5468 -4.4732 8.7238
quadrupole: 21.0032 -3.4561 -17.5471 -1.5468 -4.4732 8.7238
hfenergy: -933.8287139 hartree
pointgroup: C01 [X(C15H13N1O4)]
dipole: 0.1407582 -0.9927586 -0.8625107 debye
polarizability: 216.576852|-8.9876199|127.4220138|0.6592488|12.5073661|165.1367762 unknown
InChI: InChI=1S/C15H13NO4/c1-19-9-5-3-2-4-8(9)16-14(17)12-10-6-7-11(20-10)13(12)15(16)18/h2-7,10-13H,1H3
charge 0 multiplicity 1
33 atoms
O  2.757121 1.375676 0.707531
O  0.164323 0.874046 -2.040807
O  0.266518 -1.114264 2.22008
O  -1.943378 -1.346691 -1.494577
N  -0.120981 -0.095219 0.109068
C  2.057351 -0.240379 -0.871101
C  2.093391 -0.887422 0.54575
C  3.067229 0.967959 -0.699994
C  3.11901 0.051252 1.304849
C  0.619278 0.250449 -1.058782
C  0.672422 -0.742874 1.096094
C  4.464425 0.352338 -0.55355
C  4.495774 -0.2150 0.684035
C  -1.517257 0.200781 0.27439
C  -2.465773 -0.42892 -0.580752
C  -1.944912 1.092799 1.275484
C  -3.839789 -0.117769 -0.442842
C  -3.318121 1.38623 1.427206
C  -4.256573 0.786222 0.55995
C  -2.863938 -1.931492 -2.473066
H  2.339937 -0.903778 -1.702863
H  2.398435 -1.944571 0.578224
H  2.920438 1.811341 -1.384404
H  3.019352 0.081383 2.395984
H  5.22714 0.335657 -1.333541
H  5.290005 -0.801751 1.148041
H  -1.196416 1.554377 1.926773
H  -4.583895 -0.578737 -1.098654
H  -3.646687 2.080477 2.206468
H  -5.322681 1.016924 0.662113
H  -3.340402 -1.145975 -3.089481
H  -3.640652 -2.544425 -1.976288
H  -2.235796 -2.572441 -3.108338
