program: Gaussian 09
title: 000264719
version: EM64L-G09RevD.01
frameworkgroup: C1[X(C16H26N4OS)]
method: RPBEPBE
basis: SDD
operation: Freq
keyword: #p
keyword: freq=noraman
keyword: PBEPBE/SDD
title: #p freq=noraman PBEPBE/SDD
converged: YES YES NO NO
title: Mulliken charges:
elementType: S O N N N N C C C C C C C C C C C C C C C C H H H H H H H H H H H H H H H H H H H H H H H H H H
charge: 0.280033 -0.427286 -0.169733 -0.052480 0.000893 -0.094951 -0.383559 -0.381337 -0.380137 -0.372776 -0.373995 -0.353383 -0.351773 -0.356580 -0.669544 -0.696405 -0.337390 0.125367 0.186842 -0.223114 -0.292699 -0.373773 0.193269 0.193824 0.192408 0.192915 0.194472 0.195366 0.189535 0.189838 0.197018 0.196277 0.188092 0.187859 0.213208 0.214399 0.194782 0.194859 0.281502 0.280708 0.209817 0.209748 0.215217 0.273500 0.231491 0.231566 0.250740 0.385369
chargesum: 0.00000
title: Mulliken charges with hydrogens summed into heavy atoms:
elementType: S O N N N N C C C C C C C C C C C C C C C C
charge: 0.280033 -0.041917 -0.169733 -0.052480 0.000893 -0.094951 0.003534 0.003986 0.009701 0.006597 0.019300 0.022569 0.075834 0.033060 -0.107334 -0.061623 -0.337390 0.125367 0.186842 0.050387 0.170358 -0.123033
polarizability: 3.59941774e+02 -6.11322738e-01 2.09004433e+02 1.62105437e+00 -2.13798389e+00 1.36649976e+02
1716.lowfreq: -7.9698 -2.0939 -0.0007 0.0011 0.0014 3.5266 7.8584 16.2439 26.1996
frequency: 6.1340 16.1702 26.0249 31.4824 51.4498 55.5566 62.3749 68.7386 84.9045 95.6021 112.4866 114.8595 115.5784 126.8871 148.3422 150.3725 153.3321 178.2256 207.9371 226.4635 238.5300 253.4908 275.8220 284.7509 349.1284 384.1490 418.2771 434.5181 466.6059 487.5605 501.8010 535.2757 565.6156 609.4042 629.6259 641.7496 667.6907 693.8359 721.0809 724.8800 733.3761 736.2295 749.3636 784.0975 790.6472 822.0293 832.5213 835.4224 887.7306 897.9631 907.9713 923.1113 961.0002 984.5066 987.9753 996.5581 1016.2494 1016.3691 1024.8678 1053.1075 1061.3618 1072.8455 1075.6794 1080.0449 1081.8970 1091.6451 1121.6529 1125.5083 1166.5385 1182.1406 1187.7745 1205.7189 1206.2740 1233.3668 1236.1486 1237.8527 1260.9561 1264.6559 1279.7531 1284.6922 1287.0421 1289.5556 1291.3247 1298.1570 1298.6144 1299.2417 1319.8865 1322.1351 1343.4150 1346.9149 1353.0164 1356.3484 1357.0178 1371.8315 1387.5387 1391.1326 1402.5326 1439.7731 1442.1859 1461.0377 1461.1383 1464.7588 1466.1780 1470.5962 1475.3764 1475.9546 1476.2871 1481.5743 1486.5130 1489.0159 1526.5007 1542.8485 2949.4150 2949.9709 2952.4487 2955.2565 2959.4868 2964.8313 2968.0891 2971.1195 2979.0536 2980.1192 2982.8404 2988.0941 2995.5209 3004.8053 3016.4727 3028.1042 3038.4058 3040.3227 3047.4479 3067.6491 3070.0158 3104.8328 3117.4739 3173.7723 3232.7201 3402.1722
redmass: 4.3299 4.4034 3.8854 2.0120 4.4217 4.2295 2.4429 2.5649 3.4042 2.3470 2.5419 4.5390 4.3590 1.9415 3.3271 3.5283 2.0267 3.9251 3.9088 1.1299 4.8546 4.1348 4.2562 5.2025 3.8453 4.2571 5.4721 6.8523 3.6269 3.0985 5.0081 4.3865 6.9103 1.4717 4.7943 3.3814 7.7861 6.3104 1.0601 1.0712 1.0851 6.4441 1.1218 1.1799 5.2437 10.7417 1.6191 1.2204 1.8990 1.2329 7.9694 1.4332 1.2026 5.1556 3.0666 4.1738 1.1369 2.0927 3.9230 3.0441 3.1381 1.1036 2.4755 2.1369 2.3952 5.2543 2.8770 4.9249 2.1026 1.8640 2.3690 1.2608 1.5382 1.4310 1.3737 1.6158 1.2888 1.2619 1.0217 7.2762 1.1771 1.0558 1.3136 1.1178 3.9047 1.1089 1.7737 1.6151 1.4463 1.8989 1.6259 1.6151 1.6371 2.6210 1.2173 1.6516 1.3324 1.0967 2.2242 1.0742 1.0723 1.0653 1.0752 1.0789 1.2614 1.0819 1.0426 1.0873 1.0927 1.0962 9.0752 7.7536 1.0587 1.0588 1.0592 1.0591 1.0592 1.0589 1.0584 1.0366 1.0677 1.0591 1.0965 1.0980 1.1001 1.1023 1.1039 1.1047 1.1047 1.0572 1.1047 1.1007 1.0993 1.0979 1.1083 1.0924 1.0986 1.0661
irintensity: 0.0576 0.0859 0.3577 0.0888 0.6774 1.2123 2.9051 1.1255 2.2253 0.7157 0.3857 0.6301 2.5197 0.4110 0.2764 0.2284 0.1241 2.6788 4.2492 0.0014 3.0018 2.8756 2.5292 0.2208 0.0909 0.4479 8.0282 3.4411 0.5512 2.2366 4.8853 2.0853 5.5123 230.9755 21.6907 60.8350 2.5532 15.6030 15.6890 0.6927 8.4962 95.2130 0.2591 2.3729 12.5346 31.7795 13.1124 0.0395 5.4844 0.9680 72.5047 10.8806 0.1193 1.7760 135.2079 0.6770 0.5285 24.0039 1.2402 0.4004 2.8574 0.2781 3.5387 0.3259 1.7635 12.7438 35.9683 18.8850 236.0810 0.2073 7.6358 15.6320 0.4236 7.8916 0.1227 11.7825 5.3300 0.1282 0.1580 75.1600 0.4260 1.1700 14.9116 0.2733 51.4171 0.7531 5.8577 4.2139 2.3753 29.1827 4.6091 1.7004 0.4044 22.4616 11.1515 70.6022 106.7193 12.5971 21.1676 0.0045 0.3658 0.6521 0.1423 1.0412 7.2086 1.6248 12.3602 1.4414 1.5230 35.2403 264.4488 68.6705 0.0224 0.2960 0.3068 1.1298 6.5630 29.7824 187.3826 37.5014 69.0233 50.8244 0.0180 0.0285 0.0312 0.0113 1.0025 1.1382 67.3955 9.8083 174.4110 99.1224 55.6840 19.9896 17.5775 12.9919 0.0074 83.3414
temp: 298.150 k
press: 1.00000 atm
elementType: 16 8 7 7 7 7 6 6 6 6 6 6 6 6 6 6 6 6 6 6 6 6 1 1 1 1 1 1 1 1 1 1 1 1 1 1 1 1 1 1 1 1 1 1 1 1 1 1
symmnumber: 1
zpe: 1059473.9 jmol-1
zpe.correction: 0.403532 hartree
zpe.thermalcorrener: 0.428042 hartree
zpe.thermalcorrenthalpy: 0.428986 hartree
zpe.thermalcorrgfe: 0.343408 hartree
zpe.sumelectzpe: -1315.881640 hartree
zpe.sumelectthermal: -1315.857130 hartree
zpe.sumelectthermalent: -1315.856186 hartree
zpe.sumelectthermalfe: -1315.941765 hartree
dipole: 0.4425 0.5277 -1.5031
dipole: 1.6533
quadrupole: -126.9770 -146.4089 -142.7915
quadrupole: 7.5955 13.2000 -0.9383
quadrupole: 11.7488 -7.6831 -4.0657 7.5955 13.2000 -0.9383
hfenergy: -1316.2851722 hartree
pointgroup: C01 [X(C16H26N4O1S1)]
dipole: -0.1782328 0.2609382 0.5685573 debye
polarizability: 359.9067793|0.7550112|208.7874519|3.2105195|-4.4891651|136.9019508 unknown
InChI: InChI=1S/C16H26N4OS/c1-2-3-4-5-6-7-8-9-10-22-16-14-15(17-11-18-16)20(13-21)12-19-14/h11-12,21H,2-10,13H2,1H3
charge 0 multiplicity 1
48 atoms
S  1.495985 -1.318004 0.096776
O  7.88857 1.253333 -0.790737
N  6.468896 -0.420326 0.212851
N  4.792745 -1.994989 0.210753
N  2.713414 1.155274 0.034362
N  5.114081 1.635922 0.077512
C  -5.053686 0.310444 -0.05639
C  -6.405815 -0.437947 -0.060897
C  -3.832769 -0.63636 -0.03169
C  -7.628438 0.507085 -0.076533
C  -2.481073 0.113482 -0.02869
C  -8.980895 -0.240718 -0.081678
C  -1.266567 -0.845724 0.012884
C  -10.203422 0.705244 -0.093375
C  0.060685 -0.071277 0.010934
C  -11.550652 -0.049267 -0.098802
C  2.907055 -0.198099 0.096439
C  4.234777 -0.702766 0.158383
C  5.268806 0.282308 0.154942
C  6.122202 -1.781384 0.234663
C  7.78967 0.259305 0.244946
C  3.79642 1.992268 0.023953
H  -5.012199 0.985581 0.823987
H  -4.994064 0.963954 -0.951909
H  -6.463147 -1.09585 0.831624
H  -6.450221 -1.109224 -0.944083
H  -3.89246 -1.287429 0.865362
H  -3.87505 -1.312751 -0.910706
H  -7.584572 1.177604 0.807416
H  -7.571345 1.165997 -0.968423
H  -2.415554 0.75554 -0.931367
H  -2.442445 0.796119 0.84531
H  -9.027923 -0.909344 -0.966867
H  -9.038901 -0.901349 0.808886
H  -1.332397 -1.479847 0.91939
H  -1.307314 -1.528039 -0.859294
H  -10.155498 1.372618 0.791459
H  -10.144387 1.365285 -0.983036
H  0.2006 0.524748 -0.904765
H  0.159251 0.597823 0.880479
H  -11.636381 -0.700385 -0.989349
H  -11.648065 -0.692531 0.796248
H  -12.407487 0.649497 -0.107468
H  6.873655 -2.567752 0.271262
H  7.9154 0.704557 1.253032
H  8.57511 -0.488763 0.059144
H  3.578987 3.061758 -0.039393
H  7.163511 1.926486 -0.639641
