program: Gaussian 09
title: 000256580
version: EM64L-G09RevD.01
frameworkgroup: C1[X(C18H26NO5P)]
method: RPBEPBE
basis: SDD
operation: Freq
keyword: #p
keyword: freq=noraman
keyword: PBEPBE/SDD
title: #p freq=noraman PBEPBE/SDD
converged: YES YES NO NO
title: Mulliken charges:
elementType: P O O O O O N C C C C C C C C C C C C C C C C C C H H H H H H H H H H H H H H H H H H H H H H H H H H
charge: 1.284324 -0.506997 -0.528452 -0.626802 -0.201307 -0.198942 -0.218335 -0.372753 -0.367917 -0.376028 -0.315320 -0.371820 -0.798981 0.082630 0.082734 0.180890 0.178479 -0.354528 -0.353746 -0.219178 -0.254680 -0.211625 -0.211527 -0.661261 -0.651967 0.206022 0.200227 0.196084 0.203771 0.222935 0.223012 0.233918 0.216758 0.238871 0.242064 0.288284 0.262071 0.269571 0.270035 0.200569 0.226669 0.221618 0.239521 0.238889 0.239071 0.232810 0.233088 0.204479 0.252962 0.214746 0.215068
chargesum: 0.00000
title: Mulliken charges with hydrogens summed into heavy atoms:
elementType: P O O O O O N C C C C C C C C C C C C C C C C C C
charge: 1.284324 -0.506997 -0.528452 -0.626802 -0.201307 -0.198942 -0.218335 0.033495 0.031938 0.069919 0.135357 0.109115 -0.248626 0.082630 0.082734 0.180890 0.178479 -0.084957 -0.083711 0.208060 0.206460 0.027263 0.027543 0.009116 0.030808
polarizability: 3.22387913e+02 4.58567368e+00 2.41307238e+02 -2.79143180e+01 1.36633794e+01 1.71239739e+02
1716.lowfreq: -12.0778 -6.5515 -3.8051 -0.0013 -0.0010 -0.0003 6.7662 11.1658 14.7486
frequency: 3.6940 9.9711 14.1526 16.9297 28.6553 38.0422 44.4756 55.2979 62.7820 68.8694 83.8015 99.2325 108.2651 120.2686 127.5208 135.1428 137.8993 164.7111 167.5578 187.9065 221.5820 226.4607 229.9393 243.9269 252.5912 261.3548 283.2614 306.3684 329.7778 337.4242 378.6141 392.3619 406.8858 415.6766 449.5562 456.4403 473.6902 523.1375 540.9656 598.0771 606.2615 659.3162 659.3475 676.4682 699.5574 716.5905 731.8669 735.4821 743.9302 773.3890 785.3488 796.1395 802.2594 811.3370 830.3861 859.3746 870.5100 881.3604 906.8489 946.0226 955.0955 974.5966 997.7873 1006.3997 1010.9880 1017.0090 1019.6282 1024.1792 1027.5669 1041.5125 1066.0613 1072.5795 1075.0644 1079.0790 1091.9610 1094.7718 1106.6161 1130.3683 1146.3488 1167.6072 1170.6375 1194.2298 1202.8925 1221.4253 1237.6751 1254.2545 1264.9722 1273.0622 1279.7686 1283.7765 1290.6618 1301.7043 1309.6750 1330.9012 1337.2612 1350.4881 1353.4849 1355.1083 1360.7687 1373.2099 1390.9002 1392.3671 1416.1496 1426.0587 1445.6499 1453.5357 1455.3963 1456.5800 1460.2530 1464.8202 1464.9033 1466.3390 1475.8405 1477.9067 1482.2369 1486.7371 1490.9882 1614.9917 1617.6993 1627.3246 1676.1637 2957.7538 2959.6332 2964.0078 2984.3569 2984.9529 2986.1475 2993.1972 2998.2091 3008.8773 3012.7026 3018.5961 3020.2135 3030.0603 3041.7567 3051.3068 3077.2176 3080.7295 3082.1200 3089.2749 3090.4657 3105.2437 3107.5608 3139.5670 3152.9563 3164.4579 3174.5436
redmass: 4.8534 5.3904 4.5308 3.9834 3.3389 3.2987 3.4423 2.6537 1.8955 2.2524 4.2572 6.3873 4.3852 2.2884 2.0812 3.1982 4.9658 3.7943 3.3862 5.0068 2.2018 2.0369 4.1380 2.5059 1.4314 3.2952 4.0772 5.1913 5.3375 8.1982 4.3184 3.7160 3.9681 3.6557 3.7063 4.8811 4.6820 7.2047 6.4305 6.2708 8.2344 4.8459 6.6075 4.9416 5.5083 3.0879 1.1181 2.6664 1.3677 1.3601 5.1140 1.6785 1.1251 1.0944 2.0673 3.3158 2.2278 3.2579 1.3888 6.9429 1.5525 1.4126 4.9506 1.3455 2.6882 3.0218 2.6967 2.8835 2.7920 2.4994 2.9269 2.6651 3.1199 3.0259 2.1363 1.6674 2.1109 1.4270 1.5638 1.2071 2.0299 1.9373 2.8564 1.2409 1.4726 1.1513 1.2801 1.1128 1.2458 1.4599 1.0470 1.0988 1.3281 1.2289 3.7706 1.4063 1.2165 1.3290 1.5806 1.5616 1.2290 1.2401 5.9631 1.0798 1.2355 2.4628 2.1967 1.0404 1.0469 1.0679 1.0671 1.0815 1.0647 1.0824 1.0516 1.0949 1.0849 7.6987 8.2958 10.9504 11.7374 1.0590 1.0588 1.0593 1.0596 1.0359 1.0594 1.0364 1.0981 1.0614 1.0582 1.0988 1.0612 1.1038 1.1039 1.1044 1.1027 1.0977 1.1061 1.1039 1.0985 1.1044 1.1016 1.0864 1.0906 1.0956 1.1004
irintensity: 0.3880 0.1887 0.3937 0.3849 0.4010 0.4938 1.6453 2.2516 0.5481 1.1915 6.0558 1.3875 0.8710 0.8998 0.1231 2.0385 0.0005 17.4577 0.1522 4.1757 0.2914 5.4086 0.2650 1.9514 1.1658 2.8847 27.4243 11.5001 8.6981 2.8021 3.9445 0.8231 7.8717 8.6070 3.6621 0.0020 35.1054 9.2181 6.0113 32.3082 44.8976 3.5032 113.3272 0.2666 8.5824 77.0006 7.7918 38.9533 12.7984 10.7486 0.0865 31.6700 5.4647 2.6036 5.3467 151.9726 34.6916 83.4669 0.0103 12.8674 27.9178 2.1931 15.9465 0.0088 12.1163 132.3497 118.5644 61.8239 25.2705 13.4605 1.6807 11.2811 3.1439 2.7442 14.3400 32.6701 36.0112 4.1850 9.0090 9.2839 3.8785 2.7911 20.8370 24.3112 10.0695 0.9549 3.3423 0.0784 0.3103 0.1427 0.7025 0.3398 9.1119 11.7549 284.4385 29.3203 9.4052 11.1794 0.4950 40.8267 26.6209 22.6711 10.4328 10.8161 19.9167 11.2671 5.1399 10.0893 12.3478 1.9727 3.8458 1.1438 3.4609 0.6101 14.1937 31.2313 0.2405 1.9774 134.2578 310.7838 42.6899 0.1864 46.6319 33.9749 0.8483 16.3617 46.2858 25.1187 0.6187 35.7928 35.3444 9.1258 11.2318 26.0534 0.1146 61.0548 1.5686 45.2673 14.6382 9.9231 32.9949 36.5218 34.3073 1.6765 5.2461 6.0982 21.9292
temp: 298.150 k
press: 1.00000 atm
elementType: 15 8 8 8 8 8 7 6 6 6 6 6 6 6 6 6 6 6 6 6 6 6 6 6 6 1 1 1 1 1 1 1 1 1 1 1 1 1 1 1 1 1 1 1 1 1 1 1 1 1 1
symmnumber: 1
zpe: 1087794.2 jmol-1
zpe.correction: 0.414319 hartree
zpe.thermalcorrener: 0.442559 hartree
zpe.thermalcorrenthalpy: 0.443503 hartree
zpe.thermalcorrgfe: 0.346967 hartree
zpe.sumelectzpe: -1471.729607 hartree
zpe.sumelectthermal: -1471.701367 hartree
zpe.sumelectthermalent: -1471.700422 hartree
zpe.sumelectthermalfe: -1471.796959 hartree
dipole: -3.1299 2.5242 4.2530
dipole: 5.8528
quadrupole: -118.3009 -165.4092 -161.9434
quadrupole: 12.7454 6.5407 -5.9530
quadrupole: 30.2503 -16.8580 -13.3923 12.7454 6.5407 -5.9530
hfenergy: -1472.1439255 hartree
pointgroup: C01 [X(C18H26N1O5P1)]
dipole: 1.2753676 -0.3251513 1.8894497 debye
polarizability: 324.2255838|11.2316937|221.3313951|19.6803682|-35.0663952|189.3779106 unknown
InChI: InChI=1S/C18H26NO5P/c1-3-23-25(22,24-4-2)14-10-6-5-9-13-19-17(20)15-11-7-8-12-16(15)18(19)21/h7-8,11-12H,3-6,9-10,13-14H2,1-2H3
charge 0 multiplicity 1
51 atoms
P  -5.584441 0.787287 -0.154251
O  -5.894991 -0.934417 -0.190595
O  -6.487156 1.388937 1.215384
O  -5.954399 1.446241 -1.553332
O  3.655573 -2.254094 0.713921
O  4.129325 1.607172 -1.940432
N  3.572144 -0.368968 -0.7362
C  -0.288014 -0.087464 -0.839231
C  -1.353085 0.577561 0.061329
C  1.149545 0.139147 -0.322941
C  -2.793922 0.33315 -0.442286
C  2.198193 -0.543666 -1.230545
C  -3.839309 0.993593 0.480462
C  4.192208 -1.234886 0.21144
C  4.429906 0.70331 -1.121426
C  5.561212 -0.667567 0.440552
C  5.703721 0.493555 -0.358297
C  6.599679 -1.117887 1.268709
C  6.889376 1.242696 -0.355958
C  -5.807671 -1.725996 1.066387
C  -7.85571 1.927469 0.959799
C  7.80407 -0.36614 1.279385
C  7.946751 0.795893 0.479499
C  -6.437874 -3.083826 0.765276
C  -8.894402 0.811045 0.806743
H  -0.380378 0.310455 -1.870788
H  -0.490098 -1.176847 -0.902007
H  -1.250443 0.189754 1.096323
H  -1.159974 1.668716 0.113825
H  1.364576 1.224197 -0.273332
H  1.245211 -0.264367 0.703873
H  -2.902806 0.734581 -1.468905
H  -2.984794 -0.756263 -0.509154
H  2.001254 -1.629695 -1.28656
H  2.157952 -0.117854 -2.249368
H  -3.674525 2.083332 0.556567
H  -3.810619 0.5749 1.502412
H  6.478689 -2.017178 1.880673
H  6.988343 2.13742 -0.978483
H  -4.741613 -1.836665 1.355219
H  -6.344332 -1.195276 1.876441
H  -8.052234 2.552823 1.846435
H  -7.822621 2.566627 0.057157
H  8.637153 -0.68679 1.914021
H  8.887899 1.355327 0.508404
H  -7.497063 -2.962462 0.481876
H  -5.911755 -3.578009 -0.069024
H  -6.381257 -3.738188 1.655281
H  -8.689384 0.201473 -0.090636
H  -8.897901 0.151254 1.692361
H  -9.903409 1.251989 0.699501
