program: Gaussian 09
title: 000256566
version: EM64L-G09RevD.01
frameworkgroup: C1[X(C20H24N2O2S)]
method: RPBEPBE
basis: SDD
operation: Freq
keyword: #p
keyword: freq=noraman
keyword: PBEPBE/SDD
title: #p freq=noraman PBEPBE/SDD
converged: YES YES NO NO
title: Mulliken charges:
elementType: S O O N N C C C C C C C C C C C C C C C C C C C C H H H H H H H H H H H H H H H H H H H H H H H H
charge: -0.037539 -0.304617 -0.299772 -0.184497 -0.027481 -0.434731 -0.363089 -0.359038 -0.467681 0.456114 -0.420109 -0.521105 -0.377739 0.479377 0.478837 -0.219818 -0.466768 -0.503412 -0.366913 -0.819737 0.224766 -0.333398 0.188752 -0.531358 -0.529707 0.239184 0.216372 0.227989 0.221521 0.255901 0.259598 0.280654 0.244306 0.220115 0.238932 0.217585 0.230872 0.270018 0.265232 0.228803 0.226870 0.224289 0.252228 0.256622 0.217290 0.232896 0.253856 0.228400 0.231130
chargesum: 0.00000
title: Mulliken charges with hydrogens summed into heavy atoms:
elementType: S O O N N C C C C C C C C C C C C C C C C C C C C
charge: -0.037539 -0.304617 -0.299772 -0.184497 -0.027481 0.020825 0.086421 0.156462 0.057280 0.456114 -0.420109 -0.300991 -0.138807 0.479377 0.478837 -0.002233 -0.235897 -0.233394 -0.101681 -0.139775 0.224766 -0.081170 0.188752 0.175450 0.183679
polarizability: 3.75853879e+02 4.03823777e+00 2.87951940e+02 -7.60989443e+00 3.52413146e+00 1.50717346e+02
1716.lowfreq: -7.3277 -2.9254 -0.0011 0.0006 0.0011 4.1888 7.6904 17.9479 27.8803
frequency: 7.2896 17.3587 27.8315 30.7788 37.7380 55.6521 86.9641 90.7723 103.2041 113.8192 117.9255 138.9525 150.8683 159.0562 171.7320 189.0593 206.1616 209.7349 219.1323 236.0895 247.1848 269.6539 287.8981 313.3474 344.6813 352.9862 375.9251 398.6180 426.8628 437.1515 453.2344 469.0817 485.4609 496.0495 519.8947 548.9801 566.0710 572.0375 596.1161 618.3099 640.5785 665.4213 692.6180 695.0726 710.9516 749.5137 771.9651 787.2995 823.5908 838.5953 843.1815 853.6328 864.1873 867.8273 902.5259 936.3012 944.4084 951.0156 960.2159 962.7460 968.5360 984.3917 999.1816 1015.0773 1033.7624 1046.0670 1055.7633 1069.8528 1083.9615 1092.9518 1103.1211 1113.1439 1114.4956 1145.1728 1153.0797 1156.2699 1167.7213 1188.1695 1198.1785 1202.2524 1206.5132 1217.2914 1237.2131 1245.0911 1252.4133 1274.5883 1276.5262 1317.9697 1340.9550 1346.6529 1352.0140 1355.3115 1365.8433 1379.0051 1388.7654 1391.0574 1395.5770 1417.9607 1427.4920 1440.4228 1442.6515 1456.7058 1458.9566 1467.9356 1471.5307 1474.0867 1477.0964 1478.0759 1482.5283 1488.1076 1489.7958 1495.5243 1500.4430 1560.9313 1588.7798 1602.8059 1620.8407 2916.0292 2929.3064 2970.1992 2971.3111 2974.9028 2976.0913 2987.2228 2990.8999 3036.9842 3052.5934 3060.1475 3066.8718 3073.0216 3084.0396 3116.9514 3121.8669 3122.7566 3124.8020 3133.7039 3143.3298 3143.6759 3151.0982 3162.2236 3171.8147
redmass: 4.1910 1.1652 4.3509 3.3720 5.2434 4.1067 3.7008 4.1956 3.7284 3.2727 3.1349 2.9114 1.1695 1.1665 3.3543 3.3084 6.1970 3.5101 3.0500 4.4617 4.6510 4.2318 2.9729 3.5098 3.9608 4.0465 3.2542 4.4774 3.9062 2.8016 4.1207 3.9711 3.8085 3.4494 4.7869 6.3207 5.7250 3.5482 4.7879 3.7449 2.6009 4.6863 2.0937 3.5577 6.1212 3.6753 1.5748 5.3006 4.0915 1.6152 1.4170 1.4785 1.7555 2.5787 1.5502 4.3106 5.6188 2.4001 1.3818 1.4067 3.2096 4.1156 2.0632 1.8747 2.5759 1.5516 1.8794 2.0538 1.9917 2.7283 1.6464 1.2412 1.2411 1.6049 1.3189 1.7366 2.4862 1.1487 2.0239 1.4533 1.6592 1.5981 1.8532 1.4949 1.7436 1.6932 2.3019 1.3638 1.3248 1.8283 4.5090 1.5199 1.5462 1.9175 3.1494 3.1080 1.3720 2.2985 1.5256 1.2977 2.6808 1.0554 1.0696 1.1068 1.0464 1.2196 1.0947 1.2686 2.2747 1.0652 1.3203 1.2678 1.4121 7.5073 5.6635 6.6834 6.0436 1.0718 1.0622 1.0318 1.0848 1.0372 1.0306 1.0612 1.0843 1.1020 1.0977 1.0902 1.1031 1.1045 1.0985 1.0922 1.0858 1.1027 1.1029 1.0896 1.0916 1.0929 1.0880 1.0970 1.0972
irintensity: 0.0505 0.6115 0.1968 0.6066 1.1874 1.3143 3.0686 6.4788 1.5090 7.2180 0.4964 2.7810 1.1971 0.3969 2.2641 7.0321 3.5724 1.8111 1.5297 7.6680 0.5005 7.2275 7.6484 2.6867 1.8742 3.0036 8.0975 1.2532 7.8145 4.6626 1.6976 1.6775 6.9867 0.1623 0.8920 6.9928 3.7932 1.6600 4.1764 4.4325 12.2336 9.4394 17.5633 9.0346 8.8696 2.1379 60.1838 4.8420 4.7204 19.8267 29.1122 1.7914 0.2867 6.8466 28.5380 55.0818 62.5529 28.0207 2.5597 1.8271 30.7264 31.8491 41.7363 1.5669 7.8352 12.5855 6.4189 0.4303 45.1882 60.0034 5.8640 18.9057 2.2946 11.7387 0.9354 6.7509 66.0730 5.2135 2.1790 51.0857 7.0430 35.6480 93.4808 32.9584 15.3266 42.7525 175.7190 5.5324 2.5803 48.7839 46.9405 19.7427 5.8407 122.2908 18.1417 17.9134 8.1323 227.1128 110.4791 15.2570 28.5747 13.2033 8.5171 23.0492 12.6250 9.4676 8.4455 18.9542 75.1288 31.1141 99.3001 55.3318 24.5061 14.4498 30.9466 8.7672 275.8288 77.4829 53.8577 70.6918 5.4363 44.3517 71.2612 12.8857 72.1985 15.3748 22.8322 16.2712 30.9373 22.8550 22.3766 3.9381 5.0805 20.8674 26.3215 26.8479 7.3945 29.2098 2.9880 16.0222 4.7026
temp: 298.150 k
press: 1.00000 atm
elementType: 16 8 8 7 7 6 6 6 6 6 6 6 6 6 6 6 6 6 6 6 6 6 6 6 6 1 1 1 1 1 1 1 1 1 1 1 1 1 1 1 1 1 1 1 1 1 1 1 1
symmnumber: 1
zpe: 1047747.9 jmol-1
zpe.correction: 0.399066 hartree
zpe.thermalcorrener: 0.424188 hartree
zpe.thermalcorrenthalpy: 0.425132 hartree
zpe.thermalcorrgfe: 0.340068 hartree
zpe.sumelectzpe: -1432.652369 hartree
zpe.sumelectthermal: -1432.627247 hartree
zpe.sumelectthermalent: -1432.626303 hartree
zpe.sumelectthermalfe: -1432.711367 hartree
dipole: 0.3372 -3.0894 2.5244
dipole: 4.0038
quadrupole: -142.7274 -156.1551 -161.4509
quadrupole: 18.0218 2.1316 7.1275
quadrupole: 10.7171 -2.7106 -8.0065 18.0218 2.1316 7.1275
hfenergy: -1433.051435 hartree
pointgroup: C01 [X(C20H24N2O2S1)]
dipole: -0.1586889 -1.5460709 -0.2565121 debye
polarizability: 375.2716365|-10.3502335|251.4232214|-9.9862051|-60.5633445|187.8283066 unknown
InChI: InChI=1S/C20H24N2O2S/c1-15-5-4-6-17(13-15)21-9-11-22(12-10-21)20(25)16-7-8-18(23-2)19(14-16)24-3/h4-8,13-14H,9-12H2,1-3H3
charge 0 multiplicity 1
49 atoms
S  1.496643 3.609605 -1.102341
O  3.744226 -1.541309 1.553616
O  6.065507 -1.205237 -0.211427
N  -2.511079 0.175677 -0.409291
N  0.044104 1.314783 -1.103255
C  -2.459302 1.354294 -1.289062
C  -1.273588 -0.620758 -0.288352
C  -1.168154 2.175328 -1.091687
C  -0.225632 -0.129105 -1.300969
C  -3.716798 -0.313138 0.128959
C  1.288744 1.897945 -1.041901
C  -4.985336 0.219795 -0.250619
C  -3.695945 -1.376348 1.08556
C  2.490032 1.021286 -0.857112
C  -6.192675 -0.263045 0.308445
C  -4.898556 -1.859981 1.634414
C  -6.146626 -1.312376 1.259887
C  2.561615 0.091635 0.215088
C  3.616091 1.170959 -1.707786
C  -7.521552 0.336578 -0.125473
C  3.729322 -0.664941 0.442356
C  4.785329 0.417995 -1.483641
C  4.864997 -0.484348 -0.399663
C  3.941367 -2.970588 1.214205
C  6.765184 -0.918705 1.065374
H  -3.296186 2.02836 -1.040252
H  -2.579218 1.07696 -2.360522
H  -1.487644 -1.691078 -0.491556
H  -0.850584 -0.557559 0.737811
H  -1.077465 2.944607 -1.882882
H  -1.191295 2.719933 -0.128786
H  0.705587 -0.700376 -1.190952
H  -0.596832 -0.288929 -2.333398
H  -5.049679 1.005815 -1.01136
H  -2.746959 -1.805347 1.420131
H  -4.858996 -2.670502 2.371732
H  -7.074881 -1.696522 1.697066
H  1.727682 -0.03445 0.914296
H  3.573464 1.904338 -2.518561
H  -7.575994 1.414811 0.117103
H  -7.670516 0.240384 -1.217686
H  -8.368852 -0.163198 0.374387
H  5.665507 0.532138 -2.124195
H  4.876388 -3.118984 0.644989
H  3.081746 -3.342332 0.624181
H  3.987414 -3.496164 2.179974
H  6.110203 -1.12291 1.931294
H  7.093878 0.1372 1.085273
H  7.640521 -1.585499 1.074086
