program: Gaussian 09
title: 000256559
version: EM64L-G09RevD.01
frameworkgroup: C1[X(C19H20N2O2S)]
method: RPBEPBE
basis: SDD
operation: Freq
keyword: #p
keyword: freq=noraman
keyword: PBEPBE/SDD
title: #p freq=noraman PBEPBE/SDD
converged: YES YES NO NO
title: Mulliken charges:
elementType: S O O N N C C C C C C C C C C C C C C C C C C C H H H H H H H H H H H H H H H H H H H H
charge: -0.047837 -0.267888 -0.258744 -0.189806 -0.040377 -0.396548 -0.381388 -0.419034 -0.385949 0.290170 -0.417458 0.301161 0.489222 -0.347302 -0.370926 -0.467939 -0.829532 -0.251931 -0.356768 0.193917 -0.251091 0.172365 -0.327543 -0.203608 0.242627 0.192002 0.222514 0.234682 0.255736 0.244998 0.229628 0.254350 0.239534 0.228351 0.269076 0.224140 0.242988 0.230279 0.270075 0.223917 0.226679 0.254221 0.242329 0.236708
chargesum: 0.00000
title: Mulliken charges with hydrogens summed into heavy atoms:
elementType: S O O N N C C C C C C C C C C C C C C C C C C C
charge: -0.047837 -0.267888 -0.258744 -0.189806 -0.040377 0.038082 0.075808 0.081700 0.098029 0.290170 -0.417458 0.301161 0.489222 -0.107768 -0.142575 -0.198863 -0.132125 -0.028014 -0.086694 0.193917 -0.024412 0.172365 -0.073322 0.275430
polarizability: 3.43588680e+02 6.13836088e+00 2.83850088e+02 -5.77655237e+00 4.60687210e+00 1.38854992e+02
1716.lowfreq: -10.5372 -3.7744 -0.0016 -0.0013 -0.0002 5.2041 20.6132 31.4772 39.9117
frequency: 20.2442 31.4535 39.9099 46.1906 75.7320 83.7711 86.0192 97.7461 152.4176 164.5767 191.1529 198.2149 213.2437 226.7975 244.1027 255.5434 271.6279 311.0436 319.0079 344.6671 362.5820 401.7352 404.8879 422.3554 445.8281 451.0205 464.3904 479.4294 529.1171 549.3711 552.9765 569.0459 596.7511 630.7467 633.2211 666.4555 682.6467 697.9433 722.8292 724.0244 760.4655 776.3440 789.4126 802.0348 822.4053 838.8371 839.9309 854.4283 870.0420 882.5531 923.9667 931.2612 942.3003 945.9516 971.1134 975.3781 982.0183 1007.7897 1024.1753 1042.9042 1043.6571 1046.9702 1053.1978 1061.5217 1070.4716 1089.8470 1115.8130 1126.9590 1132.6500 1142.9635 1173.7626 1179.1618 1194.0769 1201.8234 1211.1530 1219.8037 1234.3153 1257.5126 1267.0297 1277.6533 1290.7638 1329.7685 1334.6551 1342.1534 1357.4698 1360.8770 1364.6354 1374.2514 1378.1259 1392.3541 1422.5979 1432.7360 1442.5963 1457.1774 1459.8329 1462.3533 1466.9963 1468.5957 1473.6701 1485.0322 1488.7726 1491.8562 1582.7260 1601.3145 1609.0496 1621.6721 2873.2389 2905.8511 2964.6161 2975.9134 2981.7483 3004.1658 3044.2873 3055.7331 3074.3842 3082.4446 3094.6514 3110.1052 3111.4374 3116.2908 3127.8134 3145.5479 3162.3038 3162.4633 3168.8280 3186.3265
redmass: 5.4901 4.3388 5.9329 5.9992 3.7091 4.4726 3.4931 3.1306 4.2897 5.1867 5.7369 1.0278 7.2128 5.1010 4.9287 3.6002 3.2915 2.7154 3.0608 3.7614 5.5610 2.2136 4.2631 3.0574 3.3267 2.8823 3.2419 3.4429 5.9047 3.6829 5.1988 6.5962 6.1337 3.3321 4.3762 5.5185 8.2847 3.4820 2.9881 3.0722 1.5408 6.6807 4.6566 4.8591 1.5770 1.6935 4.5191 1.3831 3.6953 1.5207 3.5370 1.5083 1.7922 1.6366 5.6070 1.3230 1.5571 2.3785 2.7555 1.5703 1.7573 2.2947 2.0914 4.2195 1.4899 2.3617 1.8991 1.0733 1.4031 3.5910 1.1259 2.1400 1.1148 2.1419 2.2600 2.0469 1.8268 1.7059 1.4121 2.6229 1.4878 1.3126 1.7305 1.4309 1.4952 1.5196 1.9443 3.1679 2.4283 1.2506 2.6615 2.0668 4.7662 1.1100 1.1151 1.1632 1.4217 1.0728 1.7446 1.2659 1.5344 1.5041 6.4410 7.8998 6.0697 8.4471 1.0701 1.0725 1.0402 1.0688 1.0652 1.0600 1.0925 1.0901 1.0974 1.0994 1.0888 1.1115 1.0933 1.0871 1.0876 1.0931 1.1006 1.0895 1.0926 1.0966
irintensity: 0.0807 0.7871 0.4837 1.5326 3.0335 2.2121 2.3293 11.3785 0.0232 0.5299 1.0555 0.4532 3.9834 2.0848 1.6933 8.8416 4.7971 1.3639 9.6966 5.1992 5.8619 1.6373 1.2651 8.4169 0.3082 6.1995 2.6819 7.5159 0.5784 3.0333 5.7953 2.9190 1.9050 7.5562 4.5571 3.5496 1.2593 5.8299 7.3972 12.9354 68.0432 19.0284 2.3190 9.5958 39.8084 2.5735 25.9565 0.8855 11.6720 30.5189 45.7762 3.0082 5.2654 4.2020 158.3856 0.8736 5.0611 31.8413 82.8776 8.0815 5.4720 1.5775 10.2512 20.5323 6.9354 1.1758 33.4246 0.0115 25.2671 32.0050 2.6244 22.8133 8.5485 3.8862 192.3269 132.0180 23.8198 89.5974 42.9640 209.5069 10.8998 13.8050 47.7480 0.2412 14.1069 5.1259 23.9579 15.5286 9.3272 16.4363 223.9402 17.1989 83.8338 30.3228 5.1979 14.2614 73.8645 28.1733 41.8731 19.2781 20.5172 91.6040 9.7658 3.6243 44.8289 13.7065 75.9884 66.0322 34.3740 24.2417 69.4314 130.6948 22.5073 25.8954 10.4706 24.5643 12.0946 27.9075 7.2905 12.9634 8.6474 35.5530 25.6921 0.9099 2.5870 3.9313
temp: 298.150 k
press: 1.00000 atm
elementType: 16 8 8 7 7 6 6 6 6 6 6 6 6 6 6 6 6 6 6 6 6 6 6 6 1 1 1 1 1 1 1 1 1 1 1 1 1 1 1 1 1 1 1 1
symmnumber: 1
zpe: 922827.2 jmol-1
zpe.correction: 0.351486 hartree
zpe.thermalcorrener: 0.372669 hartree
zpe.thermalcorrenthalpy: 0.373613 hartree
zpe.thermalcorrgfe: 0.299735 hartree
zpe.sumelectzpe: -1392.264604 hartree
zpe.sumelectthermal: -1392.243421 hartree
zpe.sumelectthermalent: -1392.242477 hartree
zpe.sumelectthermalfe: -1392.316355 hartree
dipole: 1.1329 -3.4044 1.2481
dipole: 3.7989
quadrupole: -138.8034 -150.2083 -151.3884
quadrupole: 17.1082 -1.7986 7.2157
quadrupole: 7.9966 -3.4082 -4.5884 17.1082 -1.7986 7.2157
hfenergy: -1392.61609 hartree
pointgroup: C01 [X(C19H20N2O2S1)]
dipole: 0.4366326 -1.352481 0.4625533 debye
polarizability: 343.514623|5.6214355|283.5203571|-8.662428|6.9617442|139.2587808 unknown
InChI: InChI=1S/C19H20N2O2S/c1-14-4-2-3-5-16(14)20-8-10-21(11-9-20)19(24)15-6-7-17-18(12-15)23-13-22-17/h2-7,12H,8-11,13H2,1H3
charge 0 multiplicity 1
44 atoms
S  -1.775342 3.573513 -0.74123
O  -3.888222 -2.397084 -0.645769
O  -5.847744 -1.596399 0.483706
N  2.384055 0.243878 0.180963
N  -0.198165 1.539374 0.187071
C  1.170689 -0.520197 0.532641
C  2.06891 1.335681 -0.777615
C  0.114779 0.431024 1.128224
C  1.014477 2.297335 -0.198681
C  3.607995 -0.483275 -0.009916
C  -1.468556 2.0063 -0.087912
C  4.868459 0.17903 0.164003
C  -2.616548 1.070246 0.135865
C  3.589757 -1.873565 -0.314843
C  6.054593 -0.573318 -0.016148
C  -2.566837 -0.263731 -0.384926
C  4.96007 1.630997 0.599931
C  4.786972 -2.602881 -0.471895
C  -3.789567 1.536355 0.78515
C  -3.702927 -1.054055 -0.224213
C  6.030934 -1.949701 -0.335669
C  -4.858012 -0.584801 0.438128
C  -4.929068 0.709522 0.960794
C  -5.319493 -2.693713 -0.372331
H  1.430916 -1.283003 1.287205
H  0.727683 -1.043674 -0.350242
H  1.685959 0.912844 -1.736315
H  2.983528 1.902434 -1.00809
H  -0.80232 -0.119429 1.379963
H  0.525328 0.877691 2.056947
H  1.423399 2.815454 0.692113
H  0.720043 3.0609 -0.937449
H  2.632379 -2.388016 -0.44789
H  7.018757 -0.069233 0.126537
H  -1.691158 -0.631412 -0.9263
H  4.979561 2.333385 -0.257147
H  4.096069 1.902536 1.232956
H  5.886206 1.80415 1.175131
H  -3.808756 2.571818 1.136894
H  4.745124 -3.671894 -0.709565
H  6.967794 -2.503505 -0.458943
H  -5.826082 1.071213 1.468882
H  -5.390432 -3.643803 0.178879
H  -5.876407 -2.702092 -1.3279
