program: Gaussian 09
title: 000264651
version: EM64L-G09RevD.01
frameworkgroup: C1[X(C11H15N3O2)]
method: RPBEPBE
basis: SDD
operation: Freq
keyword: #p
keyword: freq=noraman
keyword: PBEPBE/SDD
title: #p freq=noraman PBEPBE/SDD
converged: YES YES NO NO
title: Mulliken charges:
elementType: O O N N N C C C C C C C C C C C H H H H H H H H H H H H H H H
charge: -0.233548 -0.230350 -0.002783 -0.445125 0.016615 0.181115 -0.483291 -0.514346 -0.673631 -0.664041 0.493578 -0.401890 -0.349801 0.382996 -0.342976 -0.340807 0.239094 0.204723 0.237108 0.207178 0.234534 0.207402 0.228928 0.230775 0.231346 0.219189 0.289905 0.227079 0.284684 0.283442 0.282896
chargesum: 0.00000
title: Mulliken charges with hydrogens summed into heavy atoms:
elementType: O O N N N C C C C C C C C C C C
charge: -0.233548 -0.230350 -0.002783 -0.155220 0.016615 0.181115 -0.039474 -0.070059 -0.002767 0.017269 0.493578 -0.174811 -0.065117 0.382996 -0.059534 -0.057910
polarizability: 3.35334920e+02 -2.51050678e+00 1.46375922e+02 1.98319504e-01 -1.45405347e+01 8.53165980e+01
1716.lowfreq: -7.8698 -5.1346 -0.0009 0.0002 0.0004 3.3235 31.5557 41.5583 58.6177
frequency: 31.4246 41.5134 58.5874 68.8068 81.8465 90.3318 121.5191 168.4205 190.8892 198.5034 226.4701 228.1542 268.4891 294.3170 325.7589 372.8691 393.5514 420.8599 489.7863 492.3693 501.8630 532.9171 555.1713 626.8811 646.4322 658.3153 666.1064 732.3444 751.3819 773.3504 781.1601 810.5379 822.2645 860.3350 862.2619 941.0122 976.1595 987.8970 991.3550 999.9187 1029.0328 1039.1934 1043.2188 1072.9765 1096.6662 1111.7360 1129.1286 1169.4105 1221.6582 1228.2852 1251.6428 1262.3179 1282.3082 1301.8089 1308.9685 1326.1578 1347.0361 1386.8018 1392.9787 1398.5536 1444.5413 1456.5957 1471.4574 1474.5314 1475.9549 1482.8281 1486.2784 1497.4309 1521.2661 1589.5938 1597.3885 1620.1237 2963.3739 2975.8150 2984.2828 2988.1460 3047.2084 3059.3076 3082.5625 3086.2722 3089.9996 3092.8391 3126.6828 3175.1636 3183.6049 3196.9311 3438.9289
redmass: 4.2172 4.9450 4.2535 2.8157 5.4788 3.2735 3.4886 2.2565 1.3051 2.4799 4.0759 1.5781 3.2056 5.7068 3.4551 2.7737 3.6970 3.1007 3.3895 2.9293 3.9226 3.4513 1.8046 7.0671 6.4179 3.8007 4.8826 4.7067 2.7878 2.2618 1.4906 1.7256 1.3566 3.5688 1.5615 1.8961 1.3303 2.6744 2.7636 1.3239 2.0666 2.1436 1.9106 1.7997 3.1181 1.2718 2.1232 1.3379 1.6875 5.4038 1.2086 1.5713 1.3695 1.6584 1.3950 2.0096 6.9950 1.2895 1.5535 2.1599 4.2968 1.1170 1.4474 1.0434 1.0426 1.0670 1.2050 1.4969 1.9676 5.0330 8.1003 6.5490 1.0678 1.0645 1.0358 1.0353 1.0931 1.0962 1.0987 1.1001 1.1006 1.1013 1.0903 1.0893 1.0945 1.0960 1.0748
irintensity: 0.1299 0.0587 0.4020 0.1935 0.0246 0.4981 2.6879 0.6520 0.5055 1.3034 1.5901 1.4889 3.8923 0.3244 7.3587 6.6990 4.9898 0.1156 17.5068 27.1550 6.4163 5.3489 40.1541 2.7562 2.0329 4.8460 25.5733 2.8067 0.4254 11.6134 9.6684 0.7234 22.4539 5.0570 58.5320 9.6970 1.7726 33.6030 1.4266 0.0573 49.6623 80.4464 5.4830 10.4623 16.5074 19.9757 103.0675 219.0186 14.0222 734.7063 2.4447 47.7553 28.7861 52.6687 4.1286 19.4058 76.8960 10.9153 26.2752 53.8522 2.2502 19.4632 7.6936 4.5204 13.9325 12.0364 6.3680 71.2195 108.3134 19.3053 1.2544 539.0544 28.0845 36.3367 46.3240 28.5301 11.7692 1.0675 48.2827 50.9047 22.1229 51.2643 12.8898 0.3325 1.9135 0.8370 39.8650
temp: 298.150 k
press: 1.00000 atm
elementType: 8 8 7 7 7 6 6 6 6 6 6 6 6 6 6 6 1 1 1 1 1 1 1 1 1 1 1 1 1 1 1
symmnumber: 1
zpe: 652270.6 jmol-1
zpe.correction: 0.248437 hartree
zpe.thermalcorrener: 0.264688 hartree
zpe.thermalcorrenthalpy: 0.265632 hartree
zpe.thermalcorrgfe: 0.203260 hartree
zpe.sumelectzpe: -741.570443 hartree
zpe.sumelectthermal: -741.554192 hartree
zpe.sumelectthermalent: -741.553248 hartree
zpe.sumelectthermalfe: -741.615620 hartree
dipole: -10.2582 2.6075 -0.6662
dipole: 10.6054
quadrupole: -121.7726 -88.8566 -96.4356
quadrupole: 0.6977 -0.4416 -2.1214
quadrupole: -19.4177 13.4983 5.9193 0.6977 -0.4416 -2.1214
hfenergy: -741.81888 hartree
pointgroup: C01 [X(C11H15N3O2)]
dipole: -4.0223651 0.9268258 -0.6091972 debye
polarizability: 334.1222387|2.4485355|143.9519986|17.4798759|-18.6316357|88.9532024 unknown
InChI: InChI=1S/C11H15N3O2/c1-3-9(4-2)12-13-10-5-7-11(8-6-10)14(15)16/h5-8,13H,3-4H2,1-2H3
charge 0 multiplicity 1
31 atoms
O  5.246467 0.815519 0.038423
O  4.894092 -1.28881 0.856749
N  -2.026616 -0.449078 0.050435
N  -1.125805 0.558246 -0.275749
N  4.464518 -0.162889 0.377625
C  -3.316874 -0.235567 -0.132452
C  -4.243347 -1.378375 0.235271
C  -3.928466 1.063807 -0.645601
C  -4.864847 -2.076429 -1.004846
C  -4.066809 2.131179 0.479157
C  0.244734 0.355497 -0.109527
C  1.144851 1.403457 -0.469468
C  0.756992 -0.868996 0.413435
C  3.018887 0.014657 0.210268
C  2.526399 1.235841 -0.310766
C  2.139006 -1.035538 0.571393
H  -3.672021 -2.114992 0.826538
H  -5.059567 -0.992238 0.879805
H  -4.92884 0.847464 -1.059974
H  -3.339057 1.482611 -1.488598
H  -4.075081 -2.519527 -1.636272
H  -5.445965 -1.370877 -1.62705
H  -5.547787 -2.884923 -0.688311
H  -4.513952 3.059575 0.08166
H  -4.717171 1.759895 1.290542
H  -3.089711 2.383855 0.929051
H  -1.444453 1.451748 -0.669688
H  0.754153 2.345515 -0.873133
H  0.053446 -1.659075 0.682308
H  3.233896 2.024349 -0.579566
H  2.557428 -1.9636 0.969838
