program: Gaussian 09
title: 000256558
version: EM64L-G09RevD.01
frameworkgroup: C1[X(C18H19ClN2S)]
method: RPBEPBE
basis: SDD
operation: Freq
keyword: #p
keyword: freq=noraman
keyword: PBEPBE/SDD
title: #p freq=noraman PBEPBE/SDD
converged: YES YES NO NO
title: Mulliken charges:
elementType: Cl S N N C C C C C C C C C C C C C C C C C C H H H H H H H H H H H H H H H H H H H
charge: -0.065253 -0.063749 -0.168744 -0.013448 -0.391249 -0.399777 -0.401100 -0.391120 0.538934 -0.248208 -0.596672 -0.296056 -0.342893 0.487081 -0.220108 -0.237458 -0.244810 -0.377189 -0.443671 -0.222512 -0.223622 -0.246408 0.235745 0.242650 0.216865 0.241159 0.241793 0.247296 0.257533 0.231387 0.224311 0.281916 0.248905 0.253355 0.229294 0.235526 0.261215 0.233176 0.228271 0.227611 0.230023
chargesum: 0.00000
title: Mulliken charges with hydrogens summed into heavy atoms:
elementType: Cl S N N C C C C C C C C C C C C C C C C C C
charge: -0.065253 -0.063749 -0.168744 -0.013448 0.087147 0.058247 0.087990 0.097800 0.538934 -0.248208 -0.090445 -0.296056 -0.093988 0.487081 0.033247 -0.008164 -0.009284 -0.115974 -0.210495 0.005759 0.003989 -0.016384
polarizability: 2.61293265e+02 2.98430488e+01 2.16476573e+02 1.12798733e+01 -1.76678532e+01 2.14028472e+02
1716.lowfreq: -4.9502 -0.0018 0.0005 0.0009 7.7158 12.2009 18.2469 26.6106 32.2567
frequency: 18.0055 26.5625 31.7699 38.1115 66.2195 77.8562 80.5521 113.0930 147.7321 194.7977 212.5353 221.3676 241.0173 259.5453 303.5239 312.1444 316.7206 368.1297 398.1158 403.9144 412.2356 439.5506 446.3533 452.0189 469.0809 487.6108 497.6073 539.1669 550.2717 601.4523 616.8713 635.2864 654.7863 689.8680 709.5023 711.9369 728.4698 753.5337 755.4368 804.7184 829.7723 839.1568 847.7133 860.9465 907.4480 925.3945 930.3291 953.0321 965.3673 973.4238 982.6139 989.4937 1000.5508 1007.1285 1026.0529 1027.9814 1039.7656 1044.8058 1057.6597 1077.0227 1095.2946 1112.2137 1120.6600 1145.8753 1169.4040 1172.7130 1176.1710 1189.6282 1197.6083 1201.8057 1219.7621 1232.7694 1260.3727 1268.0894 1280.0418 1293.8618 1331.7681 1335.0483 1342.2628 1352.0319 1360.8480 1367.0642 1376.7470 1379.7999 1428.4734 1439.4539 1443.5950 1453.0897 1461.2902 1464.9821 1466.2811 1479.8136 1481.1177 1485.0336 1561.3390 1591.6685 1606.0851 1611.1559 2906.5035 2924.6797 2987.6781 2991.7219 2999.3739 3060.7364 3064.4222 3071.7046 3096.9868 3108.7295 3120.5947 3132.5140 3133.2282 3134.9053 3143.8640 3150.9015 3160.2072 3162.3359 3175.2667
redmass: 5.6054 5.0471 5.7086 6.9025 6.1160 5.2972 4.8361 4.6432 4.1712 4.8388 5.6449 5.7631 4.5486 4.9845 4.0546 2.6573 2.7365 4.1752 3.2722 2.8176 2.1777 3.0992 3.5220 4.6221 3.1965 3.9706 3.6277 5.1058 3.7209 5.0565 5.2884 3.5951 4.0885 3.9384 1.8183 3.5565 4.3954 1.3804 1.7831 3.8322 2.9757 1.5474 1.4465 1.2454 1.9892 2.0307 1.3991 2.3382 2.1946 1.3271 1.3772 6.0691 1.3344 5.3647 2.3410 2.6074 2.1218 1.9532 2.0097 1.7608 2.0671 3.6810 1.9211 2.4617 1.2943 1.0624 1.2845 1.1237 2.3901 1.1923 2.2034 1.4848 1.5856 1.4259 1.4014 1.4596 1.2917 1.2700 1.4792 1.6354 1.4822 3.1215 1.5918 7.4727 2.4508 2.1583 1.5349 1.1152 1.1038 1.1667 1.1728 2.0069 2.2970 1.8411 5.9749 6.0761 6.8626 5.9833 1.0694 1.0714 1.0652 1.0616 1.0685 1.0912 1.0949 1.1027 1.0910 1.0880 1.0868 1.0917 1.0925 1.0856 1.0957 1.0892 1.0945 1.1013 1.1006
irintensity: 0.1423 0.1412 1.1824 0.8713 1.5667 0.4059 2.1342 0.2012 3.7377 0.7548 5.0081 2.1893 1.9725 3.1528 2.7033 3.3406 8.3999 3.0715 0.3106 0.1784 4.2689 2.5637 4.5677 9.4077 5.8975 3.8330 4.4094 1.4913 4.5795 6.7221 0.8935 0.6719 21.9782 3.9842 64.2079 5.3350 10.4383 55.7342 74.1601 0.8675 11.0567 0.3856 1.5553 0.3383 4.9306 28.0374 2.8413 2.1489 41.8744 0.0796 0.2141 2.1124 2.0666 53.0196 26.9458 62.3747 2.1912 8.8001 4.8570 6.0860 12.0525 28.7090 12.4372 50.2985 17.9574 1.2292 14.2915 3.2965 10.3628 18.5355 12.2580 100.8638 49.5242 14.9739 17.8235 42.2791 2.6490 3.0278 4.3449 24.6605 8.0000 7.9974 39.3862 1.2099 10.9477 8.0704 150.0889 23.2560 11.7215 6.7807 74.9050 46.8286 125.6487 77.7225 2.3068 0.5968 79.1807 10.4632 40.9323 59.7028 17.2462 31.5257 57.6328 28.5449 3.3121 8.2236 2.7795 10.0801 0.1165 6.3105 7.6569 5.1672 29.4882 7.8160 14.6608 26.8087 14.3059
temp: 298.150 k
press: 1.00000 atm
elementType: 17 16 7 7 6 6 6 6 6 6 6 6 6 6 6 6 6 6 6 6 6 6 1 1 1 1 1 1 1 1 1 1 1 1 1 1 1 1 1 1 1
symmnumber: 1
zpe: 864629.1 jmol-1
zpe.correction: 0.329320 hartree
zpe.thermalcorrener: 0.348950 hartree
zpe.thermalcorrenthalpy: 0.349894 hartree
zpe.thermalcorrgfe: 0.278340 hartree
zpe.sumelectzpe: -1663.343086 hartree
zpe.sumelectthermal: -1663.323456 hartree
zpe.sumelectthermalent: -1663.322512 hartree
zpe.sumelectthermalfe: -1663.394065 hartree
dipole: 2.6995 2.8057 0.2228
dipole: 3.8999
quadrupole: -152.8906 -148.7155 -135.0980
quadrupole: -12.9548 11.6417 -0.2398
quadrupole: -7.3225 -3.1475 10.4700 -12.9548 11.6417 -0.2398
hfenergy: -1663.6724055 hartree
pointgroup: C01 [X(C18H19Cl1N2S1)]
dipole: 0.8444718 -1.1496884 0.5650594 debye
polarizability: 246.2023113|-40.8465286|214.105312|6.4182259|-8.3842205|231.4906862 unknown
InChI: InChI=1S/C18H19ClN2S/c19-16-8-4-5-9-17(16)20-10-12-21(13-11-20)18(22)14-15-6-2-1-3-7-15/h1-9H,10-14H2
charge 0 multiplicity 1
41 atoms
Cl 3.352692 0.004985 2.333236
S  -2.634965 2.841926 -1.938055
N  1.62324 0.298933 -0.279596
N  -0.762731 1.908185 -0.174769
C  0.536585 -0.024672 0.678356
C  1.105354 0.943027 -1.505843
C  -0.244197 1.252242 1.052952
C  0.321925 2.219273 -1.135198
C  2.742468 -0.565861 -0.381913
C  -2.085651 2.151895 -0.453856
C  -3.120039 1.769562 0.610369
C  3.60767 -0.836287 0.721032
C  3.099977 -1.179618 -1.621217
C  -3.367178 0.260957 0.738803
C  4.722946 -1.685346 0.622271
C  4.231257 -2.011716 -1.742062
C  5.043045 -2.283038 -0.618544
C  -3.509177 -0.551635 -0.415492
C  -3.499329 -0.33873 2.016755
C  -3.773396 -1.933777 -0.290868
C  -3.765519 -1.721745 2.143298
C  -3.901047 -2.525246 0.988187
H  -0.169601 -0.759966 0.22942
H  0.961519 -0.467517 1.591405
H  0.436278 0.264868 -2.0854
H  1.953554 1.228805 -2.151644
H  0.438137 1.955163 1.569343
H  -1.067403 0.986408 1.728137
H  -0.137989 2.671248 -2.030071
H  1.009824 2.946681 -0.662885
H  -2.840401 2.187989 1.597564
H  -4.056808 2.267008 0.307743
H  2.461816 -1.013751 -2.494808
H  5.351113 -1.851736 1.502618
H  4.466729 -2.46206 -2.712485
H  5.917767 -2.93558 -0.699669
H  -3.420302 -0.090989 -1.406784
H  -3.403116 0.280349 2.918524
H  -3.885333 -2.548811 -1.191193
H  -3.866974 -2.168862 3.138753
H  -4.10694 -3.597264 1.083086
