program: Gaussian 09
title: 000264648
version: EM64L-G09RevD.01
frameworkgroup: C1[X(C8H11NO3S)]
method: RPBEPBE
basis: SDD
operation: Freq
keyword: #p
keyword: freq=noraman
keyword: PBEPBE/SDD
title: #p freq=noraman PBEPBE/SDD
converged: YES YES NO NO
title: Mulliken charges:
elementType: S O O O N C C C C C C C C H H H H H H H H H H H
charge: 0.932828 -0.259597 -0.543174 -0.536974 -0.709985 -0.253123 0.542295 -0.235281 -0.533424 0.357373 -0.361808 -0.813360 -0.536469 0.297413 0.267122 0.255753 0.272058 0.276444 0.222025 0.321373 0.334431 0.227759 0.250717 0.225604
chargesum: 0.00000
title: Mulliken charges with hydrogens summed into heavy atoms:
elementType: S O O O N C C C C C C C C
charge: 0.932828 -0.259597 -0.543174 -0.536974 -0.054182 -0.253123 0.542295 0.062132 -0.266302 0.357373 -0.106056 -0.042832 0.167611
polarizability: 1.85390184e+02 7.49313022e+00 1.28867279e+02 9.89818428e-01 -1.00984518e+00 8.11379544e+01
1716.lowfreq: -7.1472 0.0002 0.0009 0.0025 3.4748 12.1624 54.0161 78.2337 101.1211
frequency: 53.9910 78.2274 101.1004 140.8535 144.9666 151.8908 199.0870 201.7243 219.7882 241.8098 244.3074 252.1673 283.2030 311.6038 364.0265 372.9003 404.6762 450.3494 489.1365 506.4979 535.7885 583.7535 586.9393 707.7379 718.9374 802.3835 817.2251 818.2993 887.5335 888.1909 912.3251 963.5542 982.0914 992.7299 1032.8315 1058.1582 1064.8202 1111.1033 1141.2427 1148.1105 1183.8118 1238.3174 1275.5359 1389.1039 1402.9538 1412.5521 1435.9701 1456.8884 1460.2281 1467.6496 1470.2440 1487.8652 1533.9667 1572.8029 1613.7012 2967.1035 2990.3322 3058.8436 3074.3439 3104.5033 3132.6319 3148.8002 3160.3854 3177.9246 3350.0485 3514.6202
redmass: 4.3635 4.6276 3.4100 4.1756 1.1536 2.2147 4.9711 1.4722 1.8968 4.0107 1.9333 5.8929 3.2487 5.4221 4.1014 6.1973 9.1597 3.1124 5.7157 3.7885 5.4849 3.9361 4.2975 5.9890 3.0413 11.1511 1.4510 1.4125 4.6623 1.5181 4.7110 1.3144 2.6291 4.7485 1.9900 1.5076 1.4325 1.2594 1.4648 1.5107 1.5402 2.4698 1.7503 9.0579 1.5546 1.7874 1.3035 1.4801 1.4791 1.0501 1.0595 1.1648 1.0887 5.9215 7.0294 1.0327 1.0368 1.1044 1.0968 1.1006 1.0999 1.0896 1.0920 1.0944 1.0416 1.0992
irintensity: 3.5742 1.2367 5.3381 5.9715 1.6554 20.3991 7.3310 12.3690 0.1199 0.8750 6.6004 2.7628 5.2214 6.3926 1.0026 6.8979 78.0583 6.4002 138.0177 41.8810 16.5061 3.2662 22.3621 2.9459 0.7590 70.7796 71.5738 74.2416 11.1051 24.2612 99.2318 0.8076 22.2214 18.5615 46.4391 11.4359 36.6954 0.1292 11.6787 19.4816 24.6139 165.8021 64.2114 2.0882 16.2920 27.7543 2.5059 22.4107 21.1655 14.9742 51.1679 65.0107 27.6652 85.3360 89.7151 59.8384 12.2581 41.6122 2.7467 15.3194 20.4634 3.7148 3.3294 10.5157 20.3132 19.1595
temp: 298.150 k
press: 1.00000 atm
elementType: 16 8 8 8 7 6 6 6 6 6 6 6 6 1 1 1 1 1 1 1 1 1 1 1
symmnumber: 1
zpe: 472807.2 jmol-1
zpe.correction: 0.180083 hartree
zpe.thermalcorrener: 0.194407 hartree
zpe.thermalcorrenthalpy: 0.195351 hartree
zpe.thermalcorrgfe: 0.139513 hartree
zpe.sumelectzpe: -988.757921 hartree
zpe.sumelectthermal: -988.743597 hartree
zpe.sumelectthermalent: -988.742653 hartree
zpe.sumelectthermalfe: -988.798491 hartree
dipole: -4.3291 0.0091 3.0547
dipole: 5.2983
quadrupole: -74.2898 -84.5435 -87.5757
quadrupole: 12.0454 11.9231 -1.8215
quadrupole: 7.8465 -2.4072 -5.4393 12.0454 11.9231 -1.8215
hfenergy: -988.938004 hartree
pointgroup: C01 [X(C8H11N1O3S1)]
dipole: -1.7182239 0.0858244 -1.17712 debye
dipolederiv: 2.1160569 0.0740772 -0.1958284 0.1462885 1.2608131 0.0244486 -0.1958988 0.0237578 1.5187531 -1.9172974 0.2084224 0.0279195 0.0190572 -0.3216531 -0.0017695 -0.0112696 -0.0026417 -0.2968046 -0.7233238 -0.0724779 0.0284992 -0.0947787 -0.7291113 -0.138775 0.0316007 0.0266138 -0.5217968 -0.7873074 0.0213562 -0.0596209 0.0273317 -0.5528789 0.1261741 -0.0104072 0.0367113 -0.5702146 -0.6937011 -0.0296724 0.145496 0.0053349 -0.4578368 -0.1136892 0.1836036 -0.1697406 -0.7799514 -0.3027309 0.0744587 -0.0051571 0.0444187 -0.3103671 0.0075364 -0.0587697 0.0044339 -0.2372067 0.2417223 -0.2410098 -0.0153194 0.1265316 0.3037546 0.0194983 0.0001409 0.0171234 0.0379933 0.174721 -0.0188157 -0.0037604 -0.3217566 -0.0365889 0.0162122 -0.0295254 0.0136354 -0.0769469 -0.5681215 0.1879536 0.0207296 0.2360177 -0.070984 0.0124294 0.0293786 0.0123245 -0.1770092 1.7443195 -0.0368229 -0.0057195 0.2984031 0.1876938 0.0001056 0.0378824 0.0014682 0.1364675 -0.4573099 -0.0646226 0.0008857 -0.3358293 -0.0982465 0.0093381 -0.0211136 0.0098933 -0.2126196 -0.1278221 0.1825767 0.0251523 0.1149756 -0.0667348 0.0081374 0.0029217 0.0098122 -0.0211409 0.7160764 -0.1550381 -0.0176003 -0.512638 0.3690399 0.0069388 -0.0474303 0.004117 0.3157894 0.1528728 -0.0531263 -0.0118239 -0.0101864 0.0654943 -0.0097414 -0.0075183 -0.0087596 0.1527223 0.0458256 -0.0440618 -0.0030824 -0.0573083 -0.0196977 -0.0162212 -0.0058342 -0.017013 0.1637216 -0.0126464 0.0780681 0.0071712 0.0898497 0.0025788 -0.0152283 0.006763 -0.014031 0.1742015 0.0609919 0.037576 0.0747823 0.0257149 0.085707 0.0332866 0.0804218 -0.0057175 0.0105366 0.0816225 0.0534099 -0.0759361 0.0331146 0.0965196 -0.0341605 -0.0675276 0.0164331 0.0179241 0.0055377 -0.1731975 -0.0149638 -0.0579641 -0.0700891 -0.019217 -0.0042715 -0.027703 0.1177907 0.2058217 0.0295658 0.1084427 0.034868 0.0819396 0.0286923 0.0354915 0.0355341 0.1713586 0.08889 0.0228859 -0.0225576 -0.0168236 0.279078 0.0524557 0.0324013 0.0284606 0.1089043 0.0455571 -0.0169563 -0.0641297 0.1459108 -0.0120746 -0.0948797 0.0181086 -0.0978323 -0.0974433 -0.1338188 -0.0362761 -0.0027382 -0.0881237 0.0667547 -0.0054481 -0.0083991 -0.0053303 0.1255722 0.0440639 -0.0282729 0.059159 0.1475917 -0.0531108 0.1038767 0.0092514 0.1084506 -0.060601 unknown
polarizability: 185.4222813|-7.0059144|128.6186926|-2.8941499|3.0251355|81.3544441 unknown
InChI: InChI=1S/C8H11NO3S/c1-6-5-7(12-2)3-4-8(6)13(9,10)11/h3-5H,9H2,1-2H3
charge 0 multiplicity 1
24 atoms
S  2.469583 0.53722 0.124302
O  -3.507202 -0.359344 -0.04885
O  2.66715 2.149872 0.271746
O  3.211633 -0.483829 1.151722
N  3.051795 -0.016832 -1.547716
C  0.618325 0.216572 0.031216
C  0.109347 -1.104871 -0.085235
C  -0.18675 1.361629 0.125448
C  -1.296472 -1.218631 -0.107836
C  -2.140006 -0.080392 -0.015466
C  -1.589053 1.220839 0.102335
C  0.990228 -2.33222 -0.189777
C  -4.440778 0.767922 0.061954
H  0.284822 2.34507 0.224196
H  -1.765314 -2.203342 -0.197778
H  -2.221514 2.108989 0.176667
H  1.666507 -2.245577 -1.059837
H  1.632153 -2.435596 0.702743
H  0.37968 -3.242532 -0.301304
H  3.026735 0.793119 -2.191269
H  4.010006 -0.386266 -1.416518
H  -4.310783 1.300612 1.0232
H  -5.441066 0.313877 0.020292
H  -4.315529 1.475514 -0.779831
