program: Gaussian 09
title: 000023154
version: EM64L-G09RevD.01
frameworkgroup: C1[X(C6H7Cl2N3O)]
method: RPBEPBE
basis: SDD
operation: Freq
keyword: #p
keyword: freq=noraman
keyword: PBEPBE/SDD
title: #p freq=noraman PBEPBE/SDD
converged: YES YES NO NO
title: Mulliken charges:
elementType: Cl Cl O N N N C C C C C C H H H H H H H
charge: 0.042467 0.051143 -0.199824 0.077469 -0.007550 0.120172 0.025461 -0.681518 -0.679301 0.136647 -0.240240 -0.277061 0.244162 0.222439 0.251789 0.230180 0.213455 0.238212 0.231898
chargesum: 0.00000
title: Mulliken charges with hydrogens summed into heavy atoms:
elementType: Cl Cl O N N N C C C C C C
charge: 0.042467 0.051143 -0.199824 0.077469 -0.007550 0.120172 0.269622 0.022890 0.004264 0.136647 -0.240240 -0.277061
polarizability: 1.51612598e+02 4.85473433e+00 1.26931339e+02 -1.43775980e+00 -8.77766324e-01 5.93966895e+01
1716.lowfreq: -10.4812 -7.1432 -6.7367 -0.0029 -0.0023 -0.0012 43.1839 57.6638 106.3540
frequency: 43.0223 57.6461 106.3521 140.8441 166.8002 180.8366 182.7807 190.3942 230.9984 267.7133 314.3261 377.8821 401.3331 428.5563 436.2051 516.5639 622.8701 625.8965 672.4564 745.8435 788.5604 805.6439 874.1169 889.4893 927.9682 939.6381 964.0636 1089.1772 1152.2281 1163.3503 1182.3716 1198.4277 1254.5609 1303.7762 1330.5923 1383.0626 1396.1729 1401.7355 1403.8096 1455.0913 1463.4712 1468.5686 1473.7057 1487.4158 2994.6521 2998.7027 3044.4151 3090.8119 3099.1796 3104.4338 3109.9013
redmass: 2.7918 4.8204 4.6225 14.4219 12.9693 2.0255 1.6593 12.3546 1.1323 4.9542 3.3823 5.5548 5.4523 4.3171 5.9616 4.6123 12.3312 8.6138 12.2576 6.0721 12.7210 9.0350 7.1257 3.2644 1.2148 1.4041 8.7374 1.6463 3.1008 3.1460 3.0312 4.3668 12.5832 1.3915 1.4681 1.2922 2.8819 1.9006 5.2411 1.0528 1.1761 2.2602 1.3810 1.0682 1.0357 1.0361 1.0872 1.0990 1.0987 1.1012 1.1007
irintensity: 0.3570 0.8200 1.6206 0.1184 0.0804 0.4070 0.1045 0.5004 0.0586 6.8785 1.3878 6.4530 3.6484 7.8554 3.3373 8.5421 0.0093 2.0543 1.7353 12.9754 9.7037 148.8706 0.0710 9.5459 2.6105 10.4235 237.6971 147.2729 42.1104 42.4528 179.4147 61.2870 105.1833 171.1747 6.7104 61.2636 359.7451 254.2510 36.9985 5.5796 114.5227 535.4600 271.7510 50.3017 10.9375 16.6620 3.4483 6.9799 34.9580 13.2385 31.9790
temp: 298.150 k
press: 1.00000 atm
elementType: 17 17 8 7 7 7 6 6 6 6 6 6 1 1 1 1 1 1 1
symmnumber: 1
zpe: 340627.2 jmol-1
zpe.correction: 0.129738 hartree
zpe.thermalcorrener: 0.141898 hartree
zpe.thermalcorrenthalpy: 0.142842 hartree
zpe.thermalcorrgfe: 0.089909 hartree
zpe.sumelectzpe: -1391.516357 hartree
zpe.sumelectthermal: -1391.504197 hartree
zpe.sumelectthermalent: -1391.503253 hartree
zpe.sumelectthermalfe: -1391.556186 hartree
dipole: 4.4198 0.8024 -0.0285
dipole: 4.4921
quadrupole: -76.9606 -91.9054 -81.1806
quadrupole: 1.5100 -0.1380 0.4504
quadrupole: 6.3883 -8.5565 2.1682 1.5100 -0.1380 0.4504
hfenergy: -1391.6460949 hartree
pointgroup: C01 [X(C6H7Cl2N3O1)]
dipole: -1.7121459 0.3942367 0.1913473 debye
dipolederiv: -0.1483254 -0.1541898 -0.0395341 -0.2231679 -0.8335882 -0.2128594 -0.0560467 -0.2075583 -0.111888 -0.582639 0.4009998 0.1519933 0.4223687 -0.4258462 -0.1381649 0.1646209 -0.1405856 -0.0996912 -2.1400592 -0.057479 0.0513774 -0.2180504 -0.3945983 0.0383741 0.137937 0.0372437 -0.3335469 -1.7290382 0.1779845 0.1506995 0.1763582 -0.5076667 -0.1121544 0.1824848 -0.1206329 -0.1827305 -1.2432461 -0.40637 -0.0455118 -0.6550664 -0.9163703 -0.1925931 -0.1158442 -0.1941424 -0.1758582 -0.7570469 0.3187997 0.1335357 0.2610625 -1.4763979 -0.4194858 0.1365996 -0.4216868 -0.215567 1.2454461 -0.0499433 -0.0519104 -0.4323274 0.3181958 -0.0637326 -0.2230735 -0.099511 0.376039 -0.1333748 -0.0070071 0.0017009 0.1093799 -0.0375647 0.096192 0.0421867 0.1374852 -0.0929183 -0.1311463 -0.0518028 0.0402664 -0.0154761 -0.0088613 0.0721137 0.064262 0.0612209 0.0153456 2.4470507 0.1127207 -0.0627782 0.6194174 0.8251633 0.1375896 -0.005027 0.1540752 0.2964412 1.2928385 0.1234923 -0.0450417 0.3571725 1.8794417 0.505464 0.002729 0.5011659 0.2279485 1.7788456 -0.4285699 -0.244704 -0.4426294 1.4496103 0.4272586 -0.273294 0.4257114 0.21241 -0.0339339 -0.0376511 -0.0654747 0.0559233 0.0042191 -0.0523569 -0.0215751 -0.0422942 -0.0409634 -0.0819334 0.1097153 0.0295465 0.1433594 0.0474499 -0.0205951 0.0131971 -0.0363246 0.0761724 0.006166 -0.1092781 0.065904 -0.118378 0.0262227 0.0479752 0.0621416 0.03859 0.0594034 0.1041111 -0.0169698 -0.0436134 -0.0626299 -0.0024315 -0.115895 -0.0452 -0.0553765 -0.0282138 -0.0856201 0.0709599 0.0527229 0.1039788 0.0089373 -0.0400837 0.0496738 -0.0243721 0.1012988 0.0990953 0.0345285 -0.0639745 -0.0059474 0.0222157 0.1109459 -0.0522622 0.1026426 -0.0462613 0.0928102 -0.0299398 -0.0152037 -0.0753478 0.0218693 -0.0679921 -0.0635098 -0.1156507 -0.0374205 unknown
polarizability: 150.5330359|-4.833318|123.3763342|-7.1060711|16.5694392|64.0312565 unknown
InChI: InChI=1S/C6H7Cl2N3O/c1-3(2)12-6-10-4(7)9-5(8)11-6/h3H,1-2H3
charge 0 multiplicity 1
19 atoms
Cl 1.704679 2.923965 0.797933
Cl 3.3149 -1.967931 -0.72675
O  -1.501477 -0.895593 -0.008499
N  0.73593 -1.333061 -0.331319
N  0.009481 0.885784 0.352449
N  2.3641 0.428544 0.034708
C  -2.651422 0.049265 0.339411
C  -2.996674 0.869669 -0.907572
C  -3.765935 -0.87979 0.816661
C  -0.237321 -0.422631 0.005759
C  1.314308 1.225095 0.34581
C  1.98465 -0.839612 -0.294634
H  -2.285875 0.706293 1.148662
H  -3.866964 1.515637 -0.691929
H  -2.156211 1.519177 -1.203145
H  -3.258863 0.205572 -1.749483
H  -4.642131 -0.279056 1.119791
H  -3.438355 -1.480181 1.681895
H  -4.074721 -1.567347 0.01065
