program: Gaussian 09
title: 000264647
version: EM64L-G09RevD.01
frameworkgroup: C1[X(C9H10N4O3)]
method: RPBEPBE
basis: SDD
operation: Freq
keyword: #p
keyword: freq=noraman
keyword: PBEPBE/SDD
title: #p freq=noraman PBEPBE/SDD
converged: YES YES NO NO
title: Mulliken charges:
elementType: O O O N N N N C C C C C C C C C H H H H H H H H H H
charge: -0.206307 -0.214252 -0.241776 0.014251 0.018479 -0.404625 -0.646248 0.388892 -0.508075 0.068420 -0.365363 0.368950 -0.188814 -0.376369 -0.797057 0.302498 0.269124 0.304887 0.287788 0.241825 0.263599 0.226963 0.251573 0.287735 0.304247 0.349652
chargesum: 0.00000
title: Mulliken charges with hydrogens summed into heavy atoms:
elementType: O O O N N N N C C C C C C C C C
charge: -0.206307 -0.214252 -0.241776 0.014251 0.018479 -0.116890 0.007651 0.388892 -0.238951 0.068420 -0.060476 0.368950 0.053011 -0.088581 -0.054920 0.302498
polarizability: 2.69629815e+02 -3.93030162e+00 1.52380655e+02 -1.04016138e-01 1.28004915e+00 5.90029108e+01
1716.lowfreq: -5.0312 -0.0008 -0.0006 0.0006 2.3940 7.7839 24.3847 34.0610 56.5030
frequency: 24.3228 34.0429 56.5008 65.4552 76.9746 96.2799 145.5042 155.7281 179.4327 248.0272 263.3260 283.6589 324.5754 340.7447 386.9256 421.6461 431.5015 467.3147 486.0457 504.7498 533.6360 551.0134 596.6796 609.7914 637.4508 662.0423 686.3154 705.8301 712.7123 742.6254 827.7834 847.0579 924.1414 925.2639 962.6956 965.4239 985.9231 1017.0786 1029.3408 1045.5747 1076.8673 1087.4110 1100.4617 1156.6524 1176.1019 1215.3499 1284.0171 1290.7527 1322.6496 1368.8963 1389.5635 1396.8225 1433.5184 1452.8845 1472.8096 1481.7574 1514.7762 1556.8700 1581.1850 1607.5469 1616.6742 1688.2671 2964.9221 3033.8502 3119.2904 3151.3077 3172.2488 3182.4032 3189.3321 3405.7135 3537.9698 3693.6033
redmass: 5.1045 4.1635 10.1108 3.1811 1.5134 4.1216 5.1768 6.7092 4.6839 4.7618 1.8370 3.9754 3.2462 2.7171 6.7076 3.1687 4.4386 2.2064 4.0329 1.1844 5.1699 2.4510 2.2948 4.9111 5.5616 6.4466 2.1253 7.0925 8.0403 6.5672 1.4181 6.3056 1.5533 2.8792 1.4208 1.9577 5.9596 1.3729 1.5598 2.3855 2.2682 1.7184 2.2739 4.1201 1.1613 8.0688 1.3992 2.8511 2.9465 10.6798 2.1045 1.9580 3.4507 1.2275 2.0646 1.2671 1.4399 7.2996 6.4886 1.2162 7.1110 5.5219 1.0416 1.0977 1.0930 1.0884 1.0944 1.0905 1.0967 1.0746 1.0460 1.1036
irintensity: 3.0378 19.5797 0.2379 6.1867 2.3507 4.2587 0.2413 2.1919 0.6071 1.9097 3.6083 2.1650 0.8744 25.5191 0.5780 2.0205 10.3786 117.2612 11.7156 165.1281 3.3212 68.2244 53.5679 4.8725 8.4296 1.5900 20.0228 29.5353 14.2641 53.8683 37.7638 3.9488 23.3922 7.2209 1.1951 3.2652 0.7340 2.5133 3.4599 39.2247 20.0420 15.3625 39.3609 208.9421 11.0458 381.4379 12.9115 543.1534 31.0693 118.2987 5.2111 24.7425 15.7836 144.8617 212.0614 36.3144 94.3043 116.3724 6.6770 116.0324 0.6632 267.9267 15.5045 16.7595 9.3339 7.4751 6.2419 2.1809 3.8269 5.8678 71.2784 49.4616
temp: 298.150 k
press: 1.00000 atm
elementType: 8 8 8 7 7 7 7 6 6 6 6 6 6 6 6 6 1 1 1 1 1 1 1 1 1 1
symmnumber: 1
zpe: 500539.2 jmol-1
zpe.correction: 0.190645 hartree
zpe.thermalcorrener: 0.206115 hartree
zpe.thermalcorrenthalpy: 0.207059 hartree
zpe.thermalcorrgfe: 0.145811 hartree
zpe.sumelectzpe: -792.379110 hartree
zpe.sumelectthermal: -792.363640 hartree
zpe.sumelectthermalent: -792.362696 hartree
zpe.sumelectthermalfe: -792.423944 hartree
dipole: 6.3913 -3.6904 0.1513
dipole: 7.3818
quadrupole: -99.8114 -86.5212 -94.8210
quadrupole: -31.5061 -2.0919 0.2553
quadrupole: -6.0936 7.1967 -1.1031 -31.5061 -2.0919 0.2553
hfenergy: -792.5697551 hartree
pointgroup: C01 [X(C9H10N4O3)]
dipole: -2.7604578 -0.0412292 0.9014662 debye
dipolederiv: -1.0373555 -0.0293068 -0.0069228 -0.0387718 -0.2312552 -0.0222597 -0.0250373 -0.0208986 -0.4605177 -0.5499499 -0.0149609 -0.0450537 -0.026469 -0.2376364 -0.0600614 -0.1405336 -0.0614964 -0.875804 -0.678502 0.0157256 0.0158549 0.0183863 -0.3663332 -0.045216 -0.3494676 -0.0411835 -1.1070007 1.2584738 -0.0146673 0.3560099 0.0245777 -0.0893393 0.001415 -0.1758817 0.0052018 -0.3902749 1.6608177 0.0832627 0.315788 0.1101332 0.2002144 0.1187845 0.4965199 0.1185543 1.3268103 -2.1107244 0.0168761 -0.6826628 -0.0112487 -0.3420216 -0.0064941 -0.4621368 0.0007937 -0.3582224 -1.6506093 0.028057 0.0993028 0.0362042 -0.7711264 0.0502384 0.2174704 0.047793 -0.3401727 0.6368241 -0.0009658 -0.0649334 -0.0341559 0.0070519 -0.0178182 -0.2410523 -0.0149712 -0.3161166 -0.0984909 0.0276062 0.2078023 -0.0205156 -0.1272637 0.024182 -0.1109926 0.0123618 -0.0376915 -0.1832449 -0.0026525 -0.1994931 0.0262105 -0.0369491 0.0166427 -0.4833037 -0.0179332 0.4057694 -0.0923353 0.0134994 0.0734072 0.0115158 -0.0932135 0.006064 0.1728892 0.0138646 0.0325269 -0.3306224 -0.0452059 -0.3232415 -0.0330414 0.0561479 -0.0407507 -0.3441255 -0.0434974 -0.2423384 -0.1983881 -0.0142774 -0.1053358 -0.0148751 -0.1335807 0.0234061 -0.105557 0.0305794 0.2014402 -0.1377192 0.0028778 -0.0252071 0.0238151 -0.1160905 0.0138261 0.2793482 0.0245365 0.0467609 -0.0924601 0.0107664 0.0568269 -0.0232205 0.1167194 -0.0088299 0.1068178 0.01264 -0.2039039 2.7274631 -0.0758107 0.253269 -0.0943403 0.3532215 0.0671329 1.0990162 0.0601653 1.7209464 0.1666663 0.0025553 0.0208345 0.0050789 0.1576652 -0.0126947 0.0763027 -0.0103088 0.0233888 0.10243 -0.0129861 -0.0736928 -0.0152075 0.1491608 -0.0045881 -0.0557159 -0.0079886 0.0846555 0.0472159 -0.0010993 0.0465246 -0.0037735 0.1753039 -0.0020828 0.014402 -0.0040782 0.1249302 0.0633966 -0.0010004 0.0274316 0.0007949 0.1501859 -0.0201966 0.0422983 -0.0205448 -0.0841712 0.0053826 0.0526606 -0.1484292 0.0452189 0.1061559 0.0158775 -0.1011965 0.0141013 0.0707768 -0.0419912 -0.1277475 0.0933508 -0.0802481 0.0108344 0.03683 0.0044535 -0.0145276 0.0688107 0.0751096 0.0666581 0.0605894 0.0567942 -0.0591129 -0.0702834 -0.0094954 -0.0169634 0.0348447 -0.0486973 0.0001684 0.0277843 0.0063313 0.3194526 -0.0056351 0.0570943 -0.0095978 0.0083376 0.2468291 0.0088493 0.0081305 0.0168499 0.4000864 -0.0379679 -0.0129092 -0.0353615 0.0862679 0.2604817 0.0111178 0.0120656 0.0139565 0.4017221 -0.0195207 0.0507926 -0.0212407 0.1799478 unknown
polarizability: 266.1453145|3.1788432|59.4912863|20.0786298|6.8789429|155.3767802 unknown
InChI: InChI=1S/C9H10N4O3/c1-6(11-12-9(10)14)7-3-2-4-8(5-7)13(15)16/h2-5,12H,10H2,1H3
charge 0 multiplicity 1
26 atoms
O  5.079453 -0.298607 0.87761
O  3.598046 -0.206319 2.607699
O  -4.015044 -0.647346 -2.38714
N  -1.983668 -0.56079 -0.467153
N  3.877703 -0.307589 1.349245
N  -3.311746 -0.543375 -0.126268
N  -5.588358 -0.471078 -0.672128
C  0.34311 -0.57933 0.00928
C  1.435805 -0.452483 0.901948
C  -1.066193 -0.592745 0.48887
C  0.620522 -0.687423 -1.389301
C  2.751185 -0.442802 0.391059
C  1.942509 -0.676061 -1.872024
C  3.035504 -0.554593 -0.984713
C  -1.405584 -0.630242 1.970303
C  -4.287008 -0.558509 -1.166054
H  1.309104 -0.347441 1.981798
H  -0.228401 -0.777534 -2.073313
H  4.072508 -0.54417 -1.329127
H  2.126136 -0.764485 -2.947509
H  -0.540027 -0.907372 2.588102
H  -2.193254 -1.381513 2.180661
H  -1.768972 0.353454 2.329526
H  -3.616854 -0.524164 0.856126
H  -5.82641 -0.341358 0.309165
H  -6.337265 -0.493325 -1.359764
