program: Gaussian 09
title: 000023287
version: EM64L-G09RevD.01
frameworkgroup: C1[X(C21H19NO)]
method: RPBEPBE
basis: SDD
operation: Freq
keyword: #p
keyword: freq=noraman
keyword: PBEPBE/SDD
title: #p freq=noraman PBEPBE/SDD
converged: YES YES NO NO
title: Mulliken charges:
elementType: O N C C C C C C C C C C C C C C C C C C C C C H H H H H H H H H H H H H H H H H H H
charge: -0.475896 -0.008164 -0.244135 -0.340207 -0.562808 0.031725 0.583170 0.388845 0.331154 -0.371406 -0.363248 -0.377516 -0.389079 -0.423991 -0.382610 -0.346061 -0.361018 -0.238678 -0.243213 -0.224549 -0.248072 -0.243891 -0.240817 0.276326 0.262268 0.265890 0.248021 0.355905 0.230224 0.222408 0.247458 0.267101 0.273089 0.260077 0.236111 0.234108 0.226178 0.230611 0.225072 0.228344 0.228841 0.232433
chargesum: 0.00000
title: Mulliken charges with hydrogens summed into heavy atoms:
elementType: O N C C C C C C C C C C C C C C C C C C C C C
charge: -0.119992 -0.008164 0.032192 -0.077939 -0.048896 0.031725 0.583170 0.388845 0.331154 -0.141183 -0.140840 -0.130058 -0.121979 -0.150902 -0.122533 -0.109950 -0.126910 -0.012500 -0.012601 0.000523 -0.019727 -0.015051 -0.008384
polarizability: 2.67783675e+02 -2.73475157e+01 2.28765545e+02 -6.54470316e+00 1.85297693e+01 1.76862320e+02
1716.lowfreq: -9.3162 -3.6328 -0.0007 -0.0006 0.0002 3.8586 17.3037 25.3528 34.6226
frequency: 16.1874 25.3097 34.6053 42.7892 48.2026 73.7536 91.7349 117.2889 180.7036 188.2455 206.4702 229.6107 246.6042 260.6803 292.2276 305.1421 323.2754 369.7259 371.9602 399.3036 401.5302 406.9578 411.0222 514.4663 531.4069 557.0381 562.9971 615.6390 617.2429 625.3224 630.1532 662.5292 691.0718 707.4890 709.5022 746.9740 758.2863 768.9604 776.0162 810.7800 840.7819 857.3201 861.8099 872.8627 885.9749 894.3694 926.2989 930.0446 940.7128 957.0025 960.5201 966.5409 973.5154 977.2927 983.2236 984.9209 990.3327 991.1976 999.5417 1000.1400 1027.3319 1029.0898 1050.7451 1061.4020 1073.2792 1080.3935 1085.5289 1090.5335 1093.9939 1134.3676 1166.0547 1171.4939 1173.7946 1183.4850 1190.2241 1191.0866 1210.1359 1221.5318 1234.3024 1268.8744 1300.0616 1310.9391 1318.0560 1326.4428 1343.8810 1375.8902 1380.6862 1397.8381 1412.5118 1432.9611 1436.7209 1446.5591 1473.6632 1477.9446 1479.8794 1549.6240 1587.1232 1591.5281 1592.1300 1609.0816 1611.3397 3094.6425 3116.2516 3118.4158 3118.7508 3120.9060 3123.6308 3127.0080 3129.3696 3139.4041 3140.1904 3141.8102 3142.6655 3150.6940 3154.1664 3158.2384 3165.5041 3169.4194 3209.0765 3564.3981
redmass: 4.2337 3.7980 5.3166 4.3398 4.2409 4.6572 5.1158 4.2924 3.8166 5.6312 4.5427 1.2810 4.1274 3.4273 4.9308 4.7737 5.1752 3.0130 2.7635 4.2025 2.8473 2.8779 4.6370 3.4905 3.3653 4.1116 3.0855 6.2589 6.3741 4.3760 4.4032 6.9756 4.5340 1.7213 1.8016 3.0821 2.2627 2.4478 2.0242 1.8939 2.0492 1.2725 1.2510 1.3210 3.3240 3.0803 1.9228 1.4154 2.1433 1.5887 4.3424 2.0032 1.5316 2.8466 1.4996 1.5562 4.8023 5.0519 1.3353 1.3158 2.2122 2.0539 1.6307 2.0549 1.3902 1.5256 1.5730 1.1999 1.3816 1.6181 2.2407 1.1178 1.0841 1.2618 1.4569 1.3960 2.7941 1.3661 1.4539 1.4618 3.9481 1.3601 1.3716 2.1061 1.4265 7.9485 8.9927 1.9492 1.6463 2.2174 2.1683 1.5457 2.2466 2.2311 2.2269 6.6349 6.0586 5.9065 6.1185 6.0606 6.1177 1.0566 1.0890 1.0867 1.0862 1.0861 1.0877 1.0872 1.0874 1.0896 1.0927 1.0959 1.0930 1.0983 1.0950 1.0961 1.1001 1.0987 1.1142 1.0664
irintensity: 0.0869 0.1627 0.1938 0.9949 0.6535 0.1733 0.6036 0.6427 0.5530 1.6320 9.3085 116.8152 0.2693 14.8930 0.7117 7.7775 3.5264 1.8434 0.8876 2.0626 0.0808 1.4238 0.5376 9.6760 29.6275 6.4793 16.5850 0.3021 0.0208 13.6205 10.4312 0.4296 4.2579 49.1272 53.4668 1.3068 42.9698 13.1062 46.0297 51.6051 6.0653 0.3112 0.7650 0.5305 41.2257 24.4119 11.0911 1.6500 15.1692 2.6446 3.9192 0.3958 0.0783 22.1250 4.4225 1.9568 0.7836 0.9660 0.9248 0.3615 6.4065 9.0681 30.2987 4.5774 26.1728 6.0238 1.1430 7.9576 6.8104 28.6127 4.1808 0.8405 0.0910 7.6710 8.5225 4.5865 17.5414 12.1594 4.9321 52.1038 27.9181 2.7298 0.4825 16.1586 21.0956 0.8921 0.5980 3.1548 9.9627 13.9880 13.0948 12.0502 19.1858 9.0928 21.3578 12.7317 8.3845 92.1246 37.7229 3.9605 2.5005 12.8110 3.4661 12.1304 5.6701 3.0710 16.9797 1.9711 0.9883 0.4268 25.5677 45.6339 21.8613 8.0991 21.2169 30.6766 21.8695 15.1558 3.9819 10.2218
temp: 298.150 k
press: 1.00000 atm
elementType: 8 7 6 6 6 6 6 6 6 6 6 6 6 6 6 6 6 6 6 6 6 6 6 1 1 1 1 1 1 1 1 1 1 1 1 1 1 1 1 1 1 1
symmnumber: 1
zpe: 887633.1 jmol-1
zpe.correction: 0.338082 hartree
zpe.thermalcorrener: 0.357643 hartree
zpe.thermalcorrenthalpy: 0.358587 hartree
zpe.thermalcorrgfe: 0.287494 hartree
zpe.sumelectzpe: -939.961776 hartree
zpe.sumelectthermal: -939.942214 hartree
zpe.sumelectthermalent: -939.941270 hartree
zpe.sumelectthermalfe: -940.012363 hartree
dipole: 5.0535 0.1377 0.5176
dipole: 5.0818
quadrupole: -149.7506 -123.2502 -130.5091
quadrupole: -5.7363 -7.7141 6.0466
quadrupole: -15.2473 11.2531 3.9942 -5.7363 -7.7141 6.0466
hfenergy: -940.2998572 hartree
pointgroup: C01 [X(C21H19N1O1)]
dipole: -1.9773147 0.1932298 0.2242561 debye
polarizability: 260.3296328|-31.6067085|237.1676107|2.7035583|-17.4896546|175.9142956 unknown
InChI: InChI=1S/C21H19NO/c23-21(17-7-3-1-4-8-17,18-9-5-2-6-10-18)20-15-19(20)16-11-13-22-14-12-16/h1-14,19-20,23H,15H2
charge 0 multiplicity 1
42 atoms
O  -1.002816 0.254197 2.12514
N  5.42955 0.004787 -0.95486
C  0.296325 0.914649 0.205452
C  1.58973 0.691203 1.017574
C  0.887702 2.069376 1.00401
C  -0.999423 0.207462 0.633783
C  2.893812 0.472246 0.329153
C  -0.92541 -1.259024 0.151717
C  -2.269558 0.928813 0.13559
C  3.828716 -0.465969 0.840812
C  3.273751 1.169513 -0.850204
C  -1.139535 -1.575425 -1.214472
C  -3.513088 0.241222 0.166777
C  -0.570775 -2.295226 1.047562
C  -2.257511 2.289853 -0.259308
C  5.060008 -0.663758 0.179421
C  4.526002 0.907948 -1.444582
C  -1.005868 -2.90336 -1.6738
C  -4.712813 0.89851 -0.18141
C  -0.441213 -3.626671 0.58978
C  -3.455619 2.946425 -0.617963
C  -0.656619 -3.936276 -0.772055
C  -4.688407 2.256252 -0.576397
H  0.428607 0.935227 -0.882895
H  1.450631 0.123089 1.942738
H  0.372931 2.352017 1.925413
H  1.376875 2.885769 0.462291
H  -1.938905 0.151213 2.432804
H  3.597824 -1.039657 1.74535
H  2.610892 1.913086 -1.307663
H  -1.424734 -0.783808 -1.918176
H  -3.536858 -0.81974 0.443459
H  -0.400809 -2.046013 2.099594
H  -1.310597 2.836736 -0.282462
H  5.79026 -1.385296 0.564063
H  4.832838 1.438677 -2.353606
H  -1.175526 -3.133198 -2.731822
H  -5.661786 0.351501 -0.152843
H  -0.169179 -4.420152 1.295334
H  -3.428201 3.997686 -0.926268
H  -0.55369 -4.967555 -1.127835
H  -5.617215 2.767867 -0.8522
