program: Gaussian 09
title: 000264690
version: EM64L-G09RevD.01
frameworkgroup: C1[X(C13H20BrNO2S2)]
method: RPBEPBE
basis: SDD
operation: Freq
keyword: #p
keyword: freq=noraman
keyword: PBEPBE/SDD
title: #p freq=noraman PBEPBE/SDD
converged: YES YES NO NO
title: Mulliken charges:
elementType: Br S S O O N C C C C C C C C C C C C C H H H H H H H H H H H H H H H H H H H H
charge: 0.027455 0.464637 0.876766 -0.561771 -0.566966 -0.556046 0.003700 -0.621002 -0.676119 -0.650914 -0.671334 -0.315006 -0.676730 -0.013779 -0.234676 -0.227438 -0.162845 -0.163255 -0.202706 0.249065 0.324716 0.296097 0.225113 0.216340 0.238948 0.218857 0.230358 0.224752 0.288998 0.213095 0.240884 0.207821 0.202719 0.240129 0.224029 0.282233 0.284522 0.259480 0.259871
chargesum: 0.00000
title: Mulliken charges with hydrogens summed into heavy atoms:
elementType: Br S S O O N C C C C C C C C C C C C C
charge: 0.027455 0.464637 0.876766 -0.561771 -0.566966 -0.556046 0.003700 -0.047221 0.061431 0.037250 0.055511 0.133700 -0.009852 -0.013779 0.047557 0.057083 0.096635 0.096615 -0.202706
polarizability: 3.45333504e+02 9.45823023e+00 2.20911645e+02 -6.68011521e+00 1.09157234e+00 1.40104792e+02
1716.lowfreq: -10.2625 -5.7825 -0.0015 -0.0006 0.0012 4.6111 7.5165 25.4909 28.1801
frequency: 6.3266 25.3895 28.1357 30.7679 64.3211 71.0264 79.2998 94.4156 110.8731 112.2365 146.2339 154.6687 183.4460 186.5230 204.9485 224.5017 228.1540 230.0926 245.5479 256.9351 261.2117 273.4885 303.1542 308.6523 316.0691 335.1070 368.7363 377.0529 384.2268 405.0346 407.2601 422.2825 449.8052 470.3926 516.2783 532.4332 605.0068 610.9323 630.8087 686.2211 707.2133 746.1480 772.8784 778.9504 832.9979 834.4472 859.9531 883.6546 902.6509 929.1789 933.8639 961.1629 964.9939 975.3351 980.2542 1017.8646 1024.7300 1040.2669 1048.8418 1056.1645 1061.6669 1102.3958 1106.2946 1145.6276 1175.4727 1214.4040 1248.1625 1250.2614 1254.3550 1280.7244 1295.3518 1327.8862 1372.8422 1377.2555 1383.3433 1387.0320 1390.3637 1406.9509 1412.0526 1446.1860 1449.8546 1458.8497 1464.5960 1470.5083 1476.5006 1476.7375 1481.1369 1484.6043 1495.9559 1563.9289 1592.6290 2968.6779 2974.5129 2977.9868 2980.4914 2999.4616 3018.5315 3054.4130 3057.0420 3064.8574 3072.0632 3078.9297 3087.7629 3089.1871 3093.6414 3098.5035 3119.0438 3156.4371 3159.0956 3176.6327 3179.8403
redmass: 5.1267 3.8708 5.0371 4.5596 2.2704 2.9772 3.3584 5.3127 5.4613 6.6977 9.5786 4.1053 1.0942 7.9503 2.9667 2.4710 2.6247 1.4014 1.4791 1.9951 1.9399 2.0239 6.5178 4.5109 3.2631 9.9601 6.5893 4.2563 2.6713 4.9980 2.8698 3.4800 2.9414 5.1039 10.5341 5.6173 4.8116 7.0935 14.7586 6.8289 4.1529 1.1372 3.5786 11.2510 1.2474 1.4452 1.2481 13.5388 1.8368 1.4823 1.4707 1.3364 1.2083 1.3774 7.4383 1.5124 1.4977 2.7680 6.1975 1.8689 1.2606 1.3394 2.1783 1.7857 1.1248 1.3855 3.0033 2.0673 1.4669 1.2284 1.1037 1.3762 2.8500 10.9415 1.1916 1.1894 1.1939 1.1203 1.1719 2.1142 1.0436 1.0492 1.0541 1.0633 1.0499 1.0457 1.0528 1.0672 1.0536 6.1688 8.2137 1.0378 1.0360 1.0367 1.0354 1.0603 1.0568 1.1004 1.0958 1.0979 1.0975 1.0997 1.1003 1.1014 1.1016 1.1012 1.1093 1.0893 1.0892 1.0965 1.0975
irintensity: 1.1402 0.1711 0.8571 1.4114 0.2790 0.4071 0.4980 3.2269 2.1335 2.1636 3.4759 3.6572 0.1737 11.0548 0.8593 1.3043 0.7004 0.5828 0.1363 4.8265 7.4072 4.7561 14.7199 5.1290 1.4791 29.7469 2.1939 16.5899 0.6865 6.0010 0.0102 6.8141 1.6934 29.0711 79.4042 95.6933 2.7360 0.6002 81.2254 52.7735 11.0452 20.0863 0.4242 86.3053 1.0748 46.3572 1.5052 92.3879 10.4931 0.6008 1.2763 0.0044 0.0678 0.0692 75.5730 3.2569 2.8121 5.0539 70.2005 4.1720 3.9169 3.8384 27.4426 147.2946 12.2112 1.0386 11.4678 9.0068 8.7457 1.1344 1.5461 4.1479 19.1158 0.7320 22.9593 9.5316 46.8857 19.4944 11.8855 61.4412 2.7857 2.2644 0.9666 3.5073 6.4908 15.8248 8.1679 12.2670 16.1435 35.4081 1.1818 27.3172 14.0981 60.8181 37.0177 18.6699 17.5501 1.7491 5.7556 19.1764 19.1646 36.2339 14.2174 38.8172 13.1828 5.7535 4.5587 1.5000 1.6341 1.6883 5.9362
temp: 298.150 k
press: 1.00000 atm
elementType: 35 16 16 8 8 7 6 6 6 6 6 6 6 6 6 6 6 6 6 1 1 1 1 1 1 1 1 1 1 1 1 1 1 1 1 1 1 1 1
symmnumber: 1
zpe: 795879.1 jmol-1
zpe.correction: 0.303134 hartree
zpe.thermalcorrener: 0.326972 hartree
zpe.thermalcorrenthalpy: 0.327917 hartree
zpe.thermalcorrgfe: 0.246167 hartree
zpe.sumelectzpe: -1520.454195 hartree
zpe.sumelectthermal: -1520.430357 hartree
zpe.sumelectthermalent: -1520.429412 hartree
zpe.sumelectthermalfe: -1520.511162 hartree
dipole: -4.7569 0.3818 -2.4538
dipole: 5.3660
quadrupole: -112.1628 -129.1617 -153.1505
quadrupole: 1.7777 5.0617 0.8961
quadrupole: 19.3289 2.3300 -21.6589 1.7777 5.0617 0.8961
hfenergy: -1520.757329 hartree
pointgroup: C01 [X(C13H20Br1N1O2S2)]
dipole: -1.9339843 -0.5639665 -0.6313957 debye
polarizability: 330.1877919|27.1951636|220.042855|-36.2469919|-31.891778|156.1192937 unknown
InChI: InChI=1S/C13H20BrNO2S2/c1-5-10-18(13(2,3)4)15-19(16,17)12-8-6-11(14)7-9-12/h6-9H,5,10H2,1-4H3
charge 0 multiplicity 1
39 atoms
Br 6.225496 1.10733 -1.50491
S  -2.376072 -0.883603 -0.673095
S  0.137922 0.055933 0.837369
O  0.274203 -1.057312 2.043054
O  -0.49629 1.522627 1.24534
N  -0.605478 -0.641642 -0.742744
C  -2.980011 -2.211933 0.762403
C  -3.214158 0.778891 -0.118563
C  -3.025894 -1.542062 2.140285
C  -4.365384 -2.646628 0.249357
C  -1.927688 -3.325828 0.682433
C  -2.942342 1.857588 -1.173001
C  -3.441195 3.231807 -0.666857
C  1.868142 0.34653 0.150553
C  2.157095 1.599846 -0.410438
C  2.809788 -0.688468 0.256251
C  3.462243 1.829378 -0.90235
C  4.114416 -0.460174 -0.238017
C  4.416429 0.792407 -0.8150
H  -4.285049 0.527139 -0.021992
H  -2.763444 1.0448 0.85073
H  -2.024659 -1.202205 2.457688
H  -3.738518 -0.700386 2.181953
H  -3.368426 -2.298708 2.874563
H  -4.312062 -3.082676 -0.763557
H  -5.091789 -1.813314 0.240446
H  -4.762929 -3.421751 0.932603
H  -1.837464 -3.739835 -0.337632
H  -0.941136 -2.956864 1.010754
H  -2.235384 -4.145851 1.360217
H  -1.854007 1.910604 -1.358038
H  -3.433112 1.598182 -2.130245
H  -4.524567 3.218296 -0.443821
H  -2.900592 3.523629 0.251243
H  -3.263684 4.010278 -1.430403
H  1.392252 2.38224 -0.439286
H  2.539151 -1.636506 0.731129
H  3.726198 2.7942 -1.343528
H  4.875401 -1.242357 -0.173495
