program: Gaussian 09
title: 000264649
version: EM64L-G09RevD.01
frameworkgroup: C1[X(C8H7N3O7)]
method: RPBEPBE
basis: SDD
operation: Freq
keyword: #pfreq=noraman
keyword: PBEPBE/SDD
title: #p freq=noraman PBEPBE/SDD
converged: YES YES NO NO
title: Mulliken charges:
elementType: O O O O O O O N N N C C C C C C C C H H H H H H H
charge: -0.249705 -0.149969 -0.170319 -0.177107 -0.178078 -0.175612 -0.182910 0.009091 0.006253 0.019238 0.251378 0.214899 0.334580 0.039577 0.385720 -0.597606 -0.750806 -0.503847 0.332337 0.284427 0.254775 0.238584 0.260287 0.254450 0.250362
chargesum: 0.00000
title: Mulliken charges with hydrogens summed into heavy atoms:
elementType: O O O O O O O N N N C C C C C C C C
charge: -0.249705 -0.149969 -0.170319 -0.177107 -0.178078 -0.175612 -0.182910 0.009091 0.006253 0.019238 0.251378 0.214899 0.334580 0.039577 0.385720 -0.265269 0.026981 0.261252
polarizability: 1.95539465e+02 1.67637316e+00 1.71808936e+02 -7.11862814e+00 -3.50637976e+00 7.72760913e+01
1716.lowfreq: -6.7709 -2.5065 -0.0006 0.0001 0.0004 4.4299 33.0608 40.0191 49.5398
frequency: 33.0529 39.9959 49.5330 68.4184 80.0445 114.8082 119.6465 141.1233 150.7463 168.9583 179.6435 194.4965 242.1416 260.6195 299.2912 311.2992 325.7866 331.8488 367.3300 381.9472 433.1943 491.3047 511.1405 578.2250 597.7700 637.9879 661.7489 673.0697 701.4171 723.6044 728.9078 743.5882 785.5792 812.6050 861.0606 895.6471 948.4275 1020.7830 1033.7030 1061.9064 1099.4736 1135.1894 1147.0712 1198.5515 1199.3357 1211.9367 1236.4884 1254.3157 1334.7492 1362.6960 1375.9455 1384.9143 1396.0330 1409.7251 1424.3739 1449.9201 1453.4343 1461.0357 1469.8037 1480.3766 1553.3234 1600.2126 3012.8900 3014.5119 3097.3412 3128.7644 3132.8554 3160.3450 3183.5254
redmass: 13.2506 9.3384 6.5948 8.6276 4.5128 4.6016 1.1611 1.4751 3.7155 7.9317 4.6499 4.2473 6.1785 6.6025 8.1074 9.1044 6.6851 9.4950 7.6629 4.1889 5.3423 8.2719 6.7908 6.6381 8.1567 7.7172 6.8505 9.6154 8.5214 6.4619 8.7013 14.5616 7.2339 7.6458 9.3939 9.9873 1.5215 2.0425 1.5657 2.6584 1.2132 6.2779 1.4542 1.7042 10.0139 12.0040 8.7282 8.8155 6.7287 5.9301 6.1558 8.3569 2.1385 2.2769 1.4721 2.4726 1.2070 1.0964 1.0586 1.1478 8.2931 8.4764 1.0286 1.0386 1.0949 1.1012 1.1052 1.1057 1.0918
irintensity: 0.0867 0.0947 0.8806 2.6832 4.1293 2.8293 0.2955 3.2422 1.6431 5.7887 7.4978 3.7975 6.2567 6.6033 0.5375 1.8514 1.1276 2.1155 3.9530 0.8497 4.1721 4.9647 0.3774 2.3819 7.4504 33.7229 23.7452 13.6338 24.7997 3.3481 0.2302 3.6364 19.0159 22.2012 7.1583 29.6732 36.2931 50.1980 2.4180 44.7391 2.8353 0.5595 19.9790 58.2407 294.1009 228.2143 21.3048 110.9064 59.3014 32.2153 106.0596 48.8944 55.6371 127.4841 6.3297 45.1389 37.8088 28.7547 16.5491 28.6539 56.6621 106.0342 39.5698 1.1610 4.0521 9.8941 8.8844 7.5862 22.4583
temp: 298.150 k
press: 1.00000 atm
elementType: 8 8 8 8 8 8 8 7 7 7 6 6 6 6 6 6 6 6 1 1 1 1 1 1 1
symmnumber: 1
zpe: 419479.8 jmol-1
zpe.correction: 0.159771 hartree
zpe.thermalcorrener: 0.176970 hartree
zpe.thermalcorrenthalpy: 0.177915 hartree
zpe.thermalcorrgfe: 0.113221 hartree
zpe.sumelectzpe: -998.256677 hartree
zpe.sumelectthermal: -998.239478 hartree
zpe.sumelectthermalent: -998.238533 hartree
zpe.sumelectthermalfe: -998.303228 hartree
dipole: 1.0270 -1.8467 -1.8298
dipole: 2.7952
quadrupole: -111.6998 -121.7816 -102.7042
quadrupole: 4.0884 -3.9973 1.6317
quadrupole: 0.3620 -9.7197 9.3577 4.0884 -3.9973 1.6317
hfenergy: -998.4164481 hartree
pointgroup: C01 [X(C8H7N3O7)]
dipole: 0.2843721 -0.7402268 -0.7619618 debye
dipolederiv: -1.5963378 0.3493629 0.2683156 0.269553 -0.4259368 -0.0745284 0.004326 0.0216661 -0.3618223 -0.2424623 0.0454679 0.121141 -0.0072006 -0.5959723 0.2263771 0.1674457 0.0728061 -0.5571259 -0.3108234 0.1089404 0.2184774 0.1629443 -0.5347716 -0.1105565 0.1581125 0.0343044 -0.5915093 -0.5700398 0.1891425 -0.005285 0.2166851 -0.6891473 0.1785724 0.0015721 0.1539904 -0.2681303 -0.7722968 -0.12821 0.1304704 -0.090389 -0.4878147 0.1329847 0.0821467 0.1366097 -0.2633131 -0.4356204 -0.0229746 0.0827227 -0.0207086 -0.8076729 -0.1954642 0.0766189 -0.1731035 -0.2868049 -0.7687768 -0.0655472 0.1743101 -0.0988614 -0.4142235 -0.0702885 0.1428828 -0.1350105 -0.2776869 0.3171331 -0.2135516 -0.3898909 -0.2156181 1.0864842 -0.1348152 -0.3562594 -0.1355743 1.0341052 1.6617554 -0.249565 -0.1418125 -0.3167576 0.9832992 -0.3771076 -0.1036434 -0.3215564 0.3177769 1.2086629 0.4424492 -0.2595567 0.4094096 1.3580195 0.3285815 -0.1925708 0.3159741 0.3562697 0.4523266 0.1587127 0.0074927 0.0289152 0.3729879 0.0227639 0.0287714 0.0516268 0.0337078 -0.528094 -0.0800481 0.0574297 -0.2015623 0.0002198 -0.0059586 0.0952548 -0.0310841 -0.0475331 -0.5967286 0.0914173 0.0118062 -0.0125196 -0.3202242 0.0328305 -0.0081901 0.0100126 0.0312799 1.2401001 -0.2904329 -0.0445528 -0.1338479 0.5510448 0.0521446 0.2859553 -0.0729933 0.0248927 -0.501073 -0.2464381 0.0312839 0.0217732 -0.4878821 -0.0663628 -0.0220217 -0.0413195 0.0465613 0.3827655 0.1776133 0.0350639 0.1386172 -0.1059151 -0.0041638 -0.1025348 -0.0295361 -0.0515489 -0.1591351 -0.2708607 0.0000253 -0.1535466 -0.0836897 0.0273484 0.0719262 0.098488 0.037906 0.8120638 -0.1489299 -0.2318622 -0.0152012 0.2149462 0.03118 -0.3906803 0.1265654 0.3989271 0.1616482 0.0005231 -0.0092019 -0.0004737 0.1464709 -0.0031 0.052947 0.0149228 0.1716187 0.1101228 -0.0128549 0.0261406 -0.0220885 0.0914115 -0.0111094 0.0146536 -0.0242733 0.0073585 0.0437093 0.0355671 -0.0660234 0.0383659 0.0605155 0.0434613 -0.0801218 0.0164506 0.0474493 0.055482 0.1043539 0.0387302 0.0276177 -0.0289733 -0.0483408 0.0112804 -0.0649008 0.076499 0.0702703 0.0191225 0.0155582 -0.0740447 0.0054675 0.1165245 0.0502703 0.0460377 0.0534394 0.0291289 -0.0452046 -0.0459239 -0.0043615 0.0044338 -0.1051372 0.0759788 -0.0932526 0.0133923 -0.063781 0.0519447 -0.0248586 0.0533001 0.1069224 0.0141641 -0.0641201 0.0231498 0.0542909 unknown
polarizability: 194.1998232|-0.3938886|171.7903256|-14.9664435|0.0117622|78.6343434 unknown
InChI: InChI=1S/C8H7N3O7/c1-4-5(9(12)13)3-6(10(14)15)8(18-2)7(4)11(16)17/h3H,1-2H3
charge 0 multiplicity 1
25 atoms
O  2.427919 -0.624915 0.181635
O  0.25354 -3.28946 1.012584
O  1.175418 -2.977404 -1.054017
O  -3.249924 2.198278 -0.386539
O  -3.941406 0.201044 0.466748
O  1.24522 3.427349 0.61531
O  2.892004 2.128852 -0.276894
N  0.542478 -2.568269 -0.009521
N  -3.027507 0.996592 0.025709
N  1.684906 2.315806 0.132085
C  -1.294145 -0.871637 -0.003873
C  0.094235 -1.147051 -0.00016
C  -1.616888 0.518906 0.012148
C  1.137436 -0.17721 0.008909
C  0.723893 1.189602 0.039235
C  -0.638916 1.526546 0.036712
C  -2.315913 -1.985476 -0.066334
C  3.374198 -0.703991 -0.975445
H  -0.937864 2.57776 0.068197
H  -2.762806 -2.150824 0.929589
H  -3.148624 -1.724964 -0.737934
H  -1.867105 -2.932664 -0.40017
H  3.461134 0.279451 -1.459676
H  3.014108 -1.486097 -1.664419
H  4.329309 -0.994422 -0.517276
