program: Gaussian 09
title: 000264640
version: EM64L-G09RevD.01
frameworkgroup: C1[X(C6H13N3O)]
method: RPBEPBE
basis: SDD
operation: Freq
keyword: #p
keyword: freq=noraman
keyword: PBEPBE/SDD
title: #p freq=noraman PBEPBE/SDD
converged: YES YES NO NO
title: Mulliken charges:
elementType: O N N N C C C C C C H H H H H H H H H H H H H
charge: -0.252698 0.043510 -0.407048 -0.654204 -0.462502 -0.356412 0.147647 -0.678840 -0.813279 0.296608 0.241343 0.194080 0.191990 0.223412 0.218593 0.206301 0.218330 0.232141 0.253371 0.234517 0.283581 0.342776 0.296782
chargesum: 0.00000
title: Mulliken charges with hydrogens summed into heavy atoms:
elementType: O N N N C C C C C C
charge: -0.252698 0.043510 -0.123468 -0.014646 -0.027078 0.058991 0.147647 -0.035615 -0.093251 0.296608
polarizability: 1.41654656e+02 -4.40152702e+00 9.07681560e+01 5.03589447e+00 3.26836412e+00 6.12210714e+01
1716.lowfreq: -16.5779 -7.9524 -0.0007 -0.0005 0.0007 4.6720 17.9666 51.5443 69.9990
frequency: 17.6761 51.5172 69.9564 103.9481 125.2973 141.4446 192.7004 234.0505 243.5512 274.0242 291.0496 354.3087 371.9860 453.0396 479.6565 502.6799 560.2283 590.2799 633.2812 712.0209 742.3707 810.7142 867.3867 895.5832 936.3483 977.2220 1006.2852 1037.6471 1050.7871 1070.8411 1095.1018 1144.7808 1227.1790 1264.9125 1284.2293 1289.1087 1298.3853 1339.0590 1380.7389 1390.0141 1447.2303 1458.0284 1472.8213 1477.0603 1478.2394 1485.0795 1504.6809 1601.6848 1607.1518 1682.1563 2951.6791 2962.0638 2974.4905 2976.4739 3021.4075 3027.6692 3062.2545 3074.7875 3077.0122 3098.5010 3414.2965 3538.0261 3697.1839
redmass: 3.2153 3.5819 1.9763 2.9654 1.5552 3.0438 1.8114 1.1542 1.2291 4.1950 2.9898 2.6634 3.6317 1.7383 1.6010 1.4961 2.3090 3.7478 3.9009 8.5105 1.1178 2.9148 1.3002 2.0784 2.6941 1.5943 1.5125 2.5107 2.8048 2.1079 2.0910 2.5733 1.3894 1.6866 1.2283 2.2296 1.9605 1.5234 1.2295 1.2115 1.1476 1.1230 1.0622 1.0461 1.0466 1.0747 1.5252 1.4786 3.6540 5.4750 1.0400 1.0646 1.0399 1.0578 1.0974 1.0971 1.0975 1.1001 1.1002 1.0947 1.0746 1.0459 1.1034
irintensity: 14.4374 1.2729 1.0226 3.8038 0.0131 5.1010 0.5679 0.1126 14.2514 0.2392 0.8789 3.4819 36.3749 185.9294 136.3011 2.4323 62.4296 11.9195 12.9375 17.5718 7.5729 1.4370 1.5820 5.3719 1.2063 6.2792 0.5972 21.3921 12.8395 38.5923 14.7675 119.6856 13.8642 23.3136 71.6955 56.8428 214.6984 2.3584 33.0781 10.6460 99.5364 71.7495 2.2361 13.3039 20.9257 13.9253 213.4335 112.5248 16.0159 315.6823 17.3127 24.1553 62.6686 23.0914 23.1148 6.0320 2.1006 63.6037 61.8525 19.3140 15.5134 39.7737 40.5458
temp: 298.150 k
press: 1.00000 atm
elementType: 8 7 7 7 6 6 6 6 6 6 1 1 1 1 1 1 1 1 1 1 1 1 1
symmnumber: 1
zpe: 506028.6 jmol-1
zpe.correction: 0.192736 hartree
zpe.thermalcorrener: 0.205333 hartree
zpe.thermalcorrenthalpy: 0.206277 hartree
zpe.thermalcorrgfe: 0.152603 hartree
zpe.sumelectzpe: -475.096860 hartree
zpe.sumelectthermal: -475.084264 hartree
zpe.sumelectthermalent: -475.083320 hartree
zpe.sumelectthermalfe: -475.136993 hartree
dipole: -0.3511 6.1504 1.1106
dipole: 6.2597
quadrupole: -48.7131 -63.1547 -62.8249
quadrupole: 12.4006 3.9010 -0.2392
quadrupole: 9.5178 -4.9238 -4.5940 12.4006 3.9010 -0.2392
hfenergy: -475.2895966 hartree
pointgroup: C01 [X(C6H13N3O1)]
dipole: 0.1837025 -2.3174141 0.8130778 debye
dipolederiv: -0.7059747 0.1081968 -0.0048198 0.3160337 -1.0468837 0.2027177 -0.0683724 0.2122238 -0.4384834 0.7266564 -0.1173409 -0.0612668 0.5531963 -0.3798778 0.0343771 -0.3114886 0.1033232 -0.1241074 -1.7462559 0.4353648 -0.0364942 0.1331005 -0.2387557 -0.0684302 0.1496435 -0.1000755 -0.321922 -1.2967854 -0.2917415 0.137772 -0.4328281 -0.4774295 -0.0426253 0.2136752 -0.0580846 -0.8023839 -0.1324022 -0.0592127 -0.0416596 -0.0070003 0.0311694 0.0467652 -0.155917 0.0521654 0.0772713 0.0508179 -0.03644 0.0251956 -0.0807169 0.1629087 -0.0022264 0.1671285 0.0098741 0.0878239 0.1850812 0.061608 -0.0290673 0.0850302 0.4276558 -0.1609275 -0.0809438 -0.1983963 -0.0525801 -0.0585734 -0.0598786 0.0050558 -0.059662 0.0630113 0.0149242 -0.0823614 0.0018159 0.0645548 -0.0363204 -0.0275387 0.0350548 -0.0464149 -0.2225115 0.1145645 0.040207 0.1119801 0.0943821 2.5355503 -0.1747568 -0.1714483 -0.5874584 1.5140056 -0.3476033 -0.0766811 -0.3662671 0.4876512 0.0744943 0.0276406 -0.0349849 -0.0088973 -0.0724143 0.0910882 -0.0134783 0.0571428 0.0353936 -0.0700533 0.0580894 0.0934598 0.0325971 0.0004202 -0.1207166 0.0923654 -0.0866641 -0.0381197 0.0476802 0.0101501 -0.0248759 0.022354 -0.1458856 0.1350642 -0.0095516 0.1002304 -0.0054508 -0.0082684 0.052946 0.0829388 0.0360797 -0.0009425 -0.1047018 0.0505501 -0.0823327 -0.0479495 -0.0939098 -0.0570541 -0.1152437 -0.062211 0.0827529 -0.029632 -0.1503555 -0.0450778 -0.0710679 0.0105407 0.0423374 0.0753034 0.0931546 -0.0186916 -0.1149565 0.1259472 -0.0897836 -0.0244259 0.0669607 0.0566943 -0.025758 -0.0021081 -0.1079217 0.1066462 0.0211223 0.1205102 0.0341763 0.0239359 -0.1357314 -0.0886114 -0.0254788 -0.0135773 -0.0280672 -0.070571 -0.0700489 0.0200101 -0.1055973 0.1126955 0.0032294 0.0843958 0.1046519 0.0021584 0.0167245 -0.0010001 0.1052021 0.0864344 -0.0259466 0.0939821 0.027621 0.0435861 -0.0100469 0.0360974 0.0579624 -0.0954768 0.0018892 -0.0158274 0.0424975 -0.0913288 0.0094677 0.117054 0.0693085 0.1097316 0.2659603 0.2322486 0.0108526 0.0189898 -0.0023677 0.1916382 0.0679618 0.0217069 0.0670852 0.3783739 0.2118511 0.0248932 0.0207511 0.0229095 0.0936232 0.0966123 0.015244 0.0936856 0.371168 unknown
polarizability: 142.0051826|-3.6284609|88.807434|-2.6821595|-7.8431911|62.8312665 unknown
InChI: InChI=1S/C6H13N3O/c1-3-4-5(2)8-9-6(7)10/h9H,3-4,7H2,1-2H3
charge 0 multiplicity 1
23 atoms
O  -2.802245 1.530431 -0.466198
N  -0.343199 0.150456 -0.33418
N  -1.556241 -0.425403 0.026798
N  -3.878357 -0.384422 0.315328
C  2.048759 0.086011 -0.618183
C  2.993152 0.329935 0.592693
C  0.745572 -0.586178 -0.235815
C  4.331602 0.968227 0.163746
C  0.772312 -2.033562 0.240138
C  -2.744215 0.338116 -0.075172
H  1.81023 1.052224 -1.097167
H  2.584135 -0.537121 -1.365526
H  3.190563 -0.627083 1.116961
H  2.47615 0.988155 1.317056
H  4.985701 1.154303 1.035039
H  4.879533 0.311224 -0.538202
H  4.161758 1.935324 -0.345001
H  0.126653 -2.682114 -0.387415
H  1.794436 -2.440915 0.191489
H  0.427387 -2.132751 1.290216
H  -1.604289 -1.391355 0.37589
H  -4.765458 0.109813 0.268889
H  -3.86964 -1.355816 0.619213
