program: Gaussian 09
title: 000264639
version: EM64L-G09RevD.01
frameworkgroup: C1[X(C7H14N2O2)]
method: RPBEPBE
basis: SDD
operation: Freq
keyword: #p
keyword: freq=noraman
keyword: PBEPBE/SDD
title: #p freq=noraman PBEPBE/SDD
converged: YES YES NO NO
title: Mulliken charges:
elementType: O O N N C C C C C C C H H H H H H H H H H H H H H
charge: -0.262683 -0.262717 -0.618802 -0.618760 -0.357151 -0.373611 -0.373593 -0.511025 -0.510810 0.227430 0.227345 0.186684 0.186640 0.242649 0.206189 0.206139 0.242624 0.204679 0.232130 0.232066 0.204539 0.333106 0.311907 0.333108 0.311918
chargesum: 0.00000
title: Mulliken charges with hydrogens summed into heavy atoms:
elementType: O O N N C C C C C C C
charge: -0.262683 -0.262717 0.026211 0.026266 0.016173 0.075226 0.075170 -0.074216 -0.074204 0.227430 0.227345
polarizability: 1.23850857e+02 -1.57209874e-01 8.01873451e+01 -9.80283305e+00 5.48826295e-02 8.31967416e+01
1716.lowfreq: -9.6379 -0.0004 0.0004 0.0008 4.0527 9.9093 25.6348 27.8386 49.8703
frequency: 25.5379 27.6878 49.8676 58.9751 62.5696 130.5332 132.5003 163.9231 196.6278 307.8462 377.4884 411.9838 449.9029 495.5864 503.9592 524.7070 525.7468 595.9236 599.7052 677.3134 681.8086 730.2824 758.7889 825.9439 847.3958 863.8257 933.9613 1011.6469 1038.9038 1039.9932 1056.6007 1075.5849 1081.4841 1101.5798 1128.5155 1218.3129 1222.7244 1257.9981 1267.9090 1285.6582 1287.1643 1300.2077 1332.8830 1357.4917 1364.2647 1368.8389 1444.7408 1445.3849 1466.8157 1476.6218 1488.9550 1595.2189 1596.0798 1642.4988 1642.8134 2948.5858 2971.5965 2972.1000 2983.9499 2989.8856 2996.2002 3024.4095 3025.8796 3055.9101 3065.7390 3515.7093 3515.7920 3673.6237 3673.6839
redmass: 5.5034 4.1405 3.2424 2.4089 4.1486 2.0829 2.0851 4.5493 6.0886 3.4918 3.9984 2.5037 2.2162 1.3147 1.2799 1.8282 2.0632 1.5660 1.7817 2.2643 2.2855 1.0941 1.2617 1.4704 3.7738 3.0664 1.4193 4.5403 1.6828 1.9664 2.8059 3.6043 2.1966 1.7557 1.3158 1.2712 1.4179 1.4305 1.2587 1.4405 1.0746 1.2511 1.6605 1.7168 2.3342 2.2731 1.1013 1.1051 1.0672 1.0896 1.0964 1.4359 1.4368 3.5553 3.5594 1.0590 1.0592 1.0592 1.0675 1.0618 1.0927 1.0984 1.1005 1.1033 1.1031 1.0446 1.0447 1.1042 1.1042
irintensity: 15.6612 10.4979 0.4624 1.6581 0.2338 0.4690 1.1797 17.3898 0.0150 1.8788 7.0458 1.3342 7.4438 76.3020 132.8615 115.4093 77.3331 80.8032 57.0987 41.8612 35.3247 16.2185 4.8014 1.3822 1.2208 4.5336 3.0458 1.2380 3.5113 0.3522 1.0356 0.0112 3.9592 4.9942 3.1175 18.4961 18.1391 0.0430 0.6203 135.1640 0.3709 9.2192 0.7314 47.7538 200.7729 1.4291 7.8157 17.2694 0.0057 1.0577 24.0296 108.8770 19.9266 383.8975 185.2447 24.3016 7.7449 23.4007 2.5477 72.4797 24.0278 0.0546 17.2637 0.0198 101.3970 40.3657 13.2659 20.7445 20.4040
temp: 298.150 k
press: 1.00000 atm
elementType: 8 8 7 7 6 6 6 6 6 6 6 1 1 1 1 1 1 1 1 1 1 1 1 1 1
symmnumber: 1
zpe: 556086.2 jmol-1
zpe.correction: 0.211802 hartree
zpe.thermalcorrener: 0.224968 hartree
zpe.thermalcorrenthalpy: 0.225912 hartree
zpe.thermalcorrgfe: 0.169250 hartree
zpe.sumelectzpe: -534.248211 hartree
zpe.sumelectthermal: -534.235045 hartree
zpe.sumelectthermalent: -534.234101 hartree
zpe.sumelectthermalfe: -534.290763 hartree
dipole: -0.0079 4.9348 -0.0715
dipole: 4.9353
quadrupole: -49.8573 -70.6157 -68.5379
quadrupole: -0.4047 -28.5337 0.0287
quadrupole: 13.1463 -7.6120 -5.5343 -0.4047 -28.5337 0.0287
hfenergy: -534.4600128 hartree
pointgroup: C01 [X(C7H14N2O2)]
dipole: -0.005533 1.9416901 0.0052439 debye
dipolederiv: -0.6847554 -0.0881919 -0.024072 0.0238456 -0.6613907 -0.3443077 0.1215608 -0.2923047 -0.7497948 -0.6845643 0.0890158 -0.0245348 -0.0234833 -0.6654415 0.3449139 0.1202942 0.2928052 -0.746219 -1.0050998 0.2985672 0.3708985 0.1404474 -0.5098967 0.1401989 0.2765463 0.1027378 -0.6822731 -1.0022438 -0.3024717 0.3696485 -0.1435756 -0.5088169 -0.1377445 0.276518 -0.0999845 -0.6856789 -0.0435575 -0.0000931 -0.0234065 -0.0004587 0.1088235 -0.0005264 0.0034585 -0.0004794 0.2117198 0.0793114 0.0029445 0.005808 -0.0371685 0.0383244 -0.0440735 -0.0255183 -0.0511876 0.1240356 0.0796791 -0.0028216 0.0056764 0.0381259 0.0375385 0.043222 -0.0252874 0.0502451 0.1249981 -0.3560978 -0.1154002 -0.0534874 -0.2073126 -0.0260967 -0.0525834 -0.0521664 -0.0463678 0.1537734 -0.3578435 0.1151317 -0.0523616 0.2060104 -0.0254573 0.0503052 -0.0499791 0.0441478 0.1544126 1.3635697 0.007259 -0.3970578 0.1322956 0.6701381 0.5040493 -0.4374862 0.4846763 0.8951256 1.3618976 -0.0045182 -0.3969228 -0.1298621 0.6759348 -0.5063328 -0.4386046 -0.4869764 0.8911446 0.0291034 0.0106696 0.0105904 0.0040375 -0.0483598 -0.1137647 0.0026477 -0.1404499 -0.0936382 0.0291967 -0.0105255 0.0101834 -0.003817 -0.0508097 0.1142514 0.0022152 0.1408871 -0.0912643 0.0877659 0.0107021 0.015763 0.0183671 0.0172745 -0.0739582 0.0273813 -0.0872317 -0.0386832 0.0313093 0.0097736 -0.0037779 0.0064689 -0.0336637 0.1107962 0.002779 0.1306938 -0.0615419 0.0313124 -0.0095212 -0.0035184 -0.0062746 -0.0314961 -0.1104834 0.0030466 -0.1304261 -0.0638129 0.0876163 -0.0106397 0.0153375 -0.018215 0.0155762 0.0745597 0.0269306 0.0879301 -0.0372247 0.0066795 0.0148114 0.0345367 0.0291954 0.0117861 -0.0971343 0.0345066 -0.1321825 -0.1083761 0.0776793 -0.0315456 0.0156575 -0.0018004 -0.0259978 0.0793142 -0.0151835 0.1088043 -0.0236864 0.0778528 0.0316584 0.0162655 0.002345 -0.0239672 -0.0791972 -0.0148451 -0.1088755 -0.0255833 0.0068536 -0.0150146 0.0339156 -0.0292122 0.0092136 0.0984403 0.033726 0.1335571 -0.1062419 0.1605483 -0.0554832 0.0210267 -0.0621483 0.2675728 -0.1070177 0.0477168 -0.1027844 0.2559588 0.2316463 -0.0527291 0.0160635 -0.0465632 0.2472373 -0.1257219 0.0157162 -0.1274746 0.2219852 0.1605684 0.0554676 0.0214523 0.0619555 0.2663551 0.1069729 0.048234 0.1027982 0.2572246 0.2315721 0.0529547 0.0163156 0.046797 0.2456191 0.1258216 0.015793 0.1274421 0.2236402 unknown
polarizability: 125.1146522|0.0586189|80.1864201|-6.5682976|-0.0030704|81.9338711 unknown
InChI: InChI=1S/C7H14N2O2/c8-6(10)4-2-1-3-5-7(9)11/h1-5,8-9H2
charge 0 multiplicity 1
25 atoms
O  -3.819512 -0.880145 -1.371551
O  3.820401 -0.878904 1.359379
N  -4.947508 0.24427 0.311831
N  4.941658 0.258561 -0.319739
C  -0.00294 0.820952 0.00135
C  -1.282886 -0.038293 -0.086526
C  1.279607 -0.035199 0.081113
C  -2.572467 0.814638 -0.093043
C  2.56659 0.821665 0.095586
C  -3.812811 -0.018782 -0.443146
C  3.809526 -0.011574 0.436567
H  -0.053558 1.482556 0.892285
H  0.045727 1.491047 -0.883322
H  -1.271346 -0.650788 -1.007488
H  -1.313728 -0.748571 0.763575
H  1.312544 -0.737359 -0.775643
H  1.269968 -0.656294 0.996318
H  -2.701428 1.335599 0.875797
H  -2.479046 1.599235 -0.871632
H  2.471179 1.597845 0.882305
H  2.69325 1.352902 -0.86795
H  -5.804272 -0.266609 0.09787
H  -4.946972 0.920223 1.073154
H  5.799856 -0.252325 -0.111612
H  4.937967 0.939747 -1.076378
