program: Gaussian 09
title: 000256549
version: EM64L-G09RevD.01
frameworkgroup: C1[X(C16H18N2S2)]
method: RPBEPBE
basis: SDD
operation: Freq
keyword: #p
keyword: freq=noraman
keyword: PBEPBE/SDD
title: #p freq=noraman PBEPBE/SDD
converged: YES YES NO NO
title: Mulliken charges:
elementType: S S N N C C C C C C C C C C C C C C C C H H H H H H H H H H H H H H H H H H
charge: -0.032303 0.237925 -0.174713 -0.040604 -0.418966 -0.399286 -0.387362 -0.406705 0.434414 -0.270331 -0.364519 -0.369117 -0.075358 -0.435436 -0.369203 0.451815 -0.234129 -0.812567 -0.130569 -0.503264 0.236331 0.216415 0.232366 0.220542 0.262971 0.252474 0.264509 0.237030 0.230402 0.229025 0.223845 0.222933 0.281887 0.225700 0.221223 0.226167 0.248739 0.267719
chargesum: 0.00000
title: Mulliken charges with hydrogens summed into heavy atoms:
elementType: S S N N C C C C C C C C C C C C C C C C
charge: -0.032303 0.237925 -0.174713 -0.040604 0.033780 0.053622 0.128083 0.094833 0.434414 -0.270331 -0.134117 -0.140091 -0.075358 -0.211591 -0.146270 0.451815 0.047758 -0.139478 0.118170 -0.235546
polarizability: 3.38781266e+02 5.74286686e+00 2.05862173e+02 1.75807752e+01 1.72329130e+00 1.54265098e+02
1716.lowfreq: -23.5422 -5.9249 -0.0013 -0.0009 0.0027 4.3780 9.7680 13.9671 30.7528
frequency: -23.3688 13.1371 30.7435 50.1803 58.1164 80.6488 101.3900 114.7377 139.3542 153.7353 192.6010 212.3489 219.9640 273.8417 280.5759 308.0836 318.1155 342.9886 371.4592 413.3628 417.4030 452.3312 462.9939 492.7851 515.0989 535.7671 553.2141 584.3637 609.2684 637.6050 638.4449 677.7859 683.3953 700.7068 711.8475 776.1053 790.2937 803.6316 811.3045 827.9791 844.9436 859.2584 894.7184 918.8600 924.9835 937.3929 951.8536 969.5419 985.3265 1002.0830 1016.3039 1045.6895 1051.1568 1053.6483 1071.2460 1077.8420 1087.0105 1135.0832 1154.9754 1188.7729 1201.8610 1203.3205 1206.7523 1225.2335 1232.7297 1249.4696 1262.3091 1278.5795 1322.1459 1329.0928 1337.9951 1345.6739 1355.3683 1359.7873 1378.4395 1383.9909 1397.7149 1410.9470 1426.6270 1461.6140 1465.3805 1468.4597 1470.5533 1476.9358 1487.5865 1487.8139 1524.0340 1537.6981 1571.4453 1636.1661 2917.8763 2927.1397 2969.3255 2986.4624 2989.6876 3019.3664 3028.8649 3044.4355 3052.1876 3077.1893 3085.3381 3112.7981 3117.7370 3149.6984 3156.3458 3178.3261 3197.6842 3234.3928
redmass: 1.0312 5.2549 5.3397 4.1329 5.7689 5.9143 3.2396 4.2270 4.3103 4.0892 5.4571 5.2346 4.0959 1.9539 6.0992 3.0520 3.5351 3.1428 4.0311 3.2579 4.5337 3.6535 5.6478 3.4012 2.5145 5.3844 3.7398 3.7593 3.4962 6.4225 5.5046 3.4264 5.9826 1.1748 2.8755 5.0389 4.3809 1.6834 1.3928 4.0112 1.3351 1.5463 4.6875 1.3962 1.3270 3.3514 1.3592 2.2366 1.4263 2.8042 2.3770 1.5138 1.8786 1.8409 2.0502 2.0573 1.1766 1.3662 3.4794 2.3761 1.2181 1.1450 1.4511 1.6184 2.3366 1.5973 2.0363 1.4891 1.3573 2.1692 1.3148 1.7359 1.5191 1.6035 2.5851 2.3062 1.2583 5.1433 3.2568 3.3885 1.1587 1.2372 1.0464 1.1074 1.1124 1.0932 2.7954 5.9776 5.8201 6.3332 1.0700 1.0694 1.0372 1.0635 1.0666 1.0926 1.0908 1.0978 1.0991 1.0981 1.0977 1.0885 1.0886 1.0934 1.0939 1.0897 1.0975 1.1007
irintensity: 0.2021 0.3029 0.7746 0.0049 4.1501 0.1449 1.8348 0.2693 4.7941 4.7172 3.1405 2.2611 1.3015 0.8405 0.8364 2.8517 4.4457 3.4194 1.4831 3.2014 3.5444 3.4117 0.8656 1.2890 17.3656 3.1882 1.2650 1.8159 5.1489 0.1720 0.9658 0.7313 1.5546 96.6909 0.8182 30.5130 1.8465 67.5591 1.5104 4.7906 18.6898 1.8139 14.9663 1.9600 0.6785 25.8765 0.6372 7.8141 4.9605 6.9049 59.0106 10.0927 1.4874 8.7844 0.7386 0.4691 2.1008 8.0120 13.6957 25.1916 118.3171 3.2976 4.9242 42.0964 14.0491 10.2515 25.9970 71.3473 1.2580 6.4086 1.1612 3.7755 13.6400 25.8643 37.3850 156.8826 17.2638 335.3219 4.0077 43.5579 4.0683 20.7563 12.1845 10.2830 58.6940 13.2951 255.7094 27.7920 11.5418 132.8639 88.3797 46.2413 67.9162 14.6388 11.9680 29.9383 22.2354 26.3471 13.0752 20.5751 10.5402 21.5545 35.2800 28.5231 11.2641 7.0426 0.4654 0.4614
temp: 298.150 k
press: 1.00000 atm
elementType: 16 16 7 7 6 6 6 6 6 6 6 6 6 6 6 6 6 6 6 6 1 1 1 1 1 1 1 1 1 1 1 1 1 1 1 1 1 1
symmnumber: 1
zpe: 797125.5 jmol-1
zpe.correction: 0.303609 hartree
zpe.thermalcorrener: 0.321866 hartree
zpe.thermalcorrenthalpy: 0.322811 hartree
zpe.thermalcorrgfe: 0.254843 hartree
zpe.sumelectzpe: -1524.652009 hartree
zpe.sumelectthermal: -1524.633752 hartree
zpe.sumelectthermalent: -1524.632808 hartree
zpe.sumelectthermalfe: -1524.700776 hartree
dipole: 0.8157 -3.4340 0.0058
dipole: 3.5296
quadrupole: -131.4782 -136.2081 -130.3357
quadrupole: 16.6993 3.1117 5.1300
quadrupole: 1.1958 -3.5342 2.3383 16.6993 3.1117 5.1300
hfenergy: -1524.9556183 hartree
pointgroup: C01 [X(C16H18N2S2)]
dipole: -0.337241 1.3470684 0.0003871 debye
polarizability: 337.9375326|7.200209|205.9955593|-20.8750821|-2.3674471|154.9754454 unknown
InChI: InChI=1S/C16H18N2S2/c1-13-4-6-14(7-5-13)17-8-10-18(11-9-17)16(19)15-3-2-12-20-15/h2-7,12H,8-11H2,1H3
charge 0 multiplicity 1
38 atoms
S  3.486703 -2.531564 -0.454152
S  3.895536 1.540869 1.035415
N  -1.303853 -0.242778 0.058579
N  1.602676 -0.641141 0.083082
C  -0.671656 -1.275844 0.896323
C  -0.39937 0.603969 -0.733819
C  0.648418 -1.762563 0.27525
C  0.981683 0.705825 -0.055325
C  -2.695086 -0.04031 0.05528
C  2.928115 -0.918402 -0.17852
C  -3.535253 -0.635326 1.043772
C  -3.322387 0.769769 -0.941817
C  3.905474 0.186467 -0.198129
C  -4.930388 -0.427388 1.024541
C  -4.715779 0.971808 -0.935005
C  -5.556241 0.380136 0.043358
C  5.032247 0.300393 -1.010641
C  -7.058898 0.606634 0.035064
C  5.871081 1.42844 -0.712838
C  5.417111 2.189829 0.354132
H  -1.341874 -2.152625 0.965274
H  -0.492609 -0.918241 1.935268
H  -0.812686 1.628776 -0.795767
H  -0.276365 0.232484 -1.775312
H  1.127412 -2.516992 0.924741
H  0.462304 -2.261339 -0.696519
H  1.641029 1.343657 -0.665432
H  0.866456 1.184298 0.936607
H  -3.104231 -1.240595 1.847377
H  -2.727945 1.219083 -1.743975
H  -5.544126 -0.898615 1.802626
H  -5.162533 1.595855 -1.719893
H  5.244073 -0.436861 -1.787593
H  -7.512965 0.292266 -0.924021
H  -7.554695 0.037294 0.84065
H  -7.311354 1.674933 0.178353
H  6.785747 1.662011 -1.262485
H  5.861328 3.075591 0.805551
