program: Gaussian 09
title: 000264675
version: EM64L-G09RevD.01
frameworkgroup: C1[X(C18H23N7O)]
method: RPBEPBE
basis: SDD
operation: Freq
keyword: #p
keyword: freq=noraman
keyword: PBEPBE/SDD
title: #p freq=noraman PBEPBE/SDD
converged: NO YES NO NO
title: Mulliken charges:
elementType: O N N N N N N N C C C C C C C C C C C C C C C C C C H H H H H H H H H H H H H H H H H H H H H H H
charge: -0.323482 -0.126382 -0.122863 -0.138621 -0.128038 -0.244019 -0.290151 -0.345891 -0.451152 -0.451248 -0.451610 -0.450956 -0.362565 -0.355773 -0.358075 -0.359513 0.122690 0.083011 0.086252 0.179251 0.275275 -0.350118 -0.346001 -0.220513 -0.238061 -0.229995 0.223486 0.227901 0.222006 0.228496 0.221371 0.228531 0.221737 0.226710 0.223059 0.242671 0.226030 0.249685 0.228555 0.251876 0.224159 0.248282 0.360445 0.365021 0.276529 0.213119 0.230950 0.227059 0.230871
chargesum: 0.00000
title: Mulliken charges with hydrogens summed into heavy atoms:
elementType: O N N N N N N N C C C C C C C C C C C C C C C C C C
charge: -0.323482 -0.126382 -0.122863 -0.138621 -0.128038 -0.244019 0.070295 0.019130 0.000234 -0.000746 -0.001708 -0.002509 0.103164 0.119941 0.122356 0.112929 0.122690 0.083011 0.086252 0.179251 0.275275 -0.073590 -0.132881 0.010437 -0.011003 0.000876
polarizability: 4.19370519e+02 -9.49575788e+00 2.92405032e+02 -4.78564669e+00 -8.17661895e+00 1.30743058e+02
1716.lowfreq: -0.0004 0.0007 0.0010 1.4990 3.0181 5.4434 18.9004 21.1437 30.7723
frequency: 18.8999 21.1091 30.7507 40.8225 53.9161 60.0898 77.9282 81.4443 86.6571 109.2467 129.9032 153.3981 177.9679 188.7875 202.8443 207.1596 229.5748 239.9109 243.3347 258.1963 271.9523 288.8631 291.3475 352.5336 399.9372 408.3015 432.0903 455.3413 511.4098 558.9266 564.6607 567.7864 575.8796 614.2203 624.6084 661.6340 670.9489 674.0202 677.7119 694.2252 699.0222 701.1224 722.7623 773.3138 786.3173 798.4203 840.4199 851.7211 859.0283 860.3308 865.0133 866.6864 886.3526 911.4968 912.4276 915.6506 917.9074 931.8658 938.6774 968.4591 973.8597 982.3298 988.8871 1005.7923 1022.6162 1038.8050 1051.3568 1063.8385 1082.9584 1091.3813 1110.3636 1121.9309 1133.5539 1158.6351 1159.4382 1169.4100 1172.3375 1173.8805 1186.3905 1191.2751 1193.9164 1206.1930 1215.1214 1215.1297 1236.1947 1241.5901 1261.1390 1271.9681 1299.9205 1300.7725 1306.3558 1309.6804 1311.6031 1322.1178 1328.7493 1334.0099 1336.7896 1341.6342 1385.4667 1413.7595 1433.2426 1445.7452 1460.5721 1468.4594 1470.2415 1472.8473 1474.8611 1487.6051 1491.1424 1492.5841 1494.6469 1500.4031 1525.5382 1541.4109 1567.3471 1598.0045 1610.7454 1616.8717 2971.8122 2977.3558 2980.9184 2984.0385 3008.6013 3009.0518 3009.3335 3010.2782 3053.5748 3061.1783 3062.7238 3065.1724 3077.7447 3078.0846 3091.2870 3091.5382 3119.7257 3131.3491 3144.4425 3157.7426 3169.2674 3458.2306 3557.8736
redmass: 3.7661 5.1000 5.2244 3.3487 3.4069 3.9699 3.0565 3.3460 3.7138 5.3660 4.1326 3.7724 4.7207 5.3457 6.5276 5.5577 3.0841 1.7807 1.8591 4.6669 5.9705 6.8831 4.6450 6.5331 2.8383 5.8187 5.2742 4.4355 5.5800 1.1863 2.3944 1.8253 3.2182 5.4245 1.4337 6.1399 5.4948 4.4375 6.4328 2.1434 7.5253 2.3316 2.6798 10.0748 2.1748 2.1042 2.0038 1.2584 2.2691 2.5286 2.0102 2.6924 12.3376 2.6802 2.4724 1.4192 1.3793 1.4365 3.0664 1.7909 1.7982 1.3838 6.0202 1.3378 2.6514 2.7213 2.0392 2.1018 1.8825 2.0745 1.6488 1.7429 2.2685 1.5691 1.4873 1.5269 1.0692 1.7498 2.0823 1.3740 2.6251 2.8078 1.2800 1.2880 1.4136 1.4468 2.0261 5.0521 1.3490 1.3773 1.8183 1.2464 1.2555 1.3977 1.5406 1.6041 1.6171 1.6753 8.7810 5.1436 2.6733 5.1102 3.9351 1.0891 1.0889 1.1068 1.1169 2.4418 1.1041 1.0907 1.2084 1.1291 4.4030 3.8556 6.7712 6.7743 6.5705 8.2172 1.0666 1.0671 1.0676 1.0676 1.0663 1.0608 1.0641 1.0634 1.0960 1.0960 1.0958 1.0959 1.1007 1.1007 1.1054 1.1054 1.0864 1.0874 1.0924 1.0958 1.1004 1.0795 1.0791
irintensity: 0.0133 1.5664 0.8987 0.2912 0.4086 1.7256 0.5092 0.6473 0.6437 0.3853 5.3054 3.3934 0.7836 0.9673 1.4908 6.3287 0.0243 0.1513 0.1556 3.7394 12.6229 5.6781 0.9847 3.8573 0.2442 1.6940 4.5524 11.3274 32.2729 77.4394 3.1203 2.0884 13.8392 6.1363 91.4357 0.4929 23.2545 2.9760 8.0964 35.2066 1.0401 53.1267 2.0369 21.4894 40.4258 0.2520 0.4867 0.9619 15.1754 15.6035 4.8356 8.1639 0.0956 8.8461 21.1888 1.3651 0.7615 4.5019 5.8301 10.6828 2.0154 0.6979 0.0587 1.2883 8.4844 1.7387 0.8244 1.9716 3.6055 14.6851 5.8466 7.7550 11.3562 2.8089 2.3375 3.3694 2.1146 8.0390 1.1831 14.9150 6.5317 0.5538 15.1548 38.1576 0.2547 0.4008 24.6437 9.1152 9.5618 0.9028 2.2705 0.0164 0.0371 2.6760 28.0575 55.4391 11.5089 24.6582 7.0710 175.2461 182.8750 1126.3072 689.9903 7.5178 9.6338 130.8202 40.1485 340.8065 28.1373 28.3193 289.0870 25.4574 1387.9450 498.0619 262.5597 4.3771 5.5498 41.7196 52.7750 48.4711 32.8265 25.6412 41.9042 32.0760 34.1795 27.5195 25.7715 24.0077 18.5931 15.2838 45.8402 27.3010 48.0457 78.4031 10.9290 2.0411 27.6966 16.3066 24.7173 176.9024 165.6029
temp: 298.150 k
press: 1.00000 atm
elementType: 8 7 7 7 7 7 7 7 6 6 6 6 6 6 6 6 6 6 6 6 6 6 6 6 6 6 1 1 1 1 1 1 1 1 1 1 1 1 1 1 1 1 1 1 1 1 1 1 1
symmnumber: 1
zpe: 1053013.3 jmol-1
zpe.correction: 0.401072 hartree
zpe.thermalcorrener: 0.424572 hartree
zpe.thermalcorrenthalpy: 0.425516 hartree
zpe.thermalcorrgfe: 0.344924 hartree
zpe.sumelectzpe: -1156.316479 hartree
zpe.sumelectthermal: -1156.292979 hartree
zpe.sumelectthermalent: -1156.292035 hartree
zpe.sumelectthermalfe: -1156.372627 hartree
dipole: 2.7097 5.0020 -0.0142
dipole: 5.6888
quadrupole: -122.9542 -143.0232 -155.7058
quadrupole: -15.7111 -0.6047 -1.3708
quadrupole: 17.6069 -2.4621 -15.1448 -15.7111 -0.6047 -1.3708
hfenergy: -1156.7175507 hartree
pointgroup: C01 [X(C18H23N7O1)]
dipole: -0.9071381 2.0426146 -0.1187876 debye
polarizability: 420.0299782|-0.9309202|292.1367101|-5.3979897|-1.6228134|130.3519202 unknown
InChI: InChI=1S/C18H23N7O/c26-15(14-8-2-1-3-9-14)22-23-16-19-17(24-10-4-5-11-24)21-18(20-16)25-12-6-7-13-25/h1-3,8-9,22-23H,4-7,10-13H2
charge 0 multiplicity 1
49 atoms
O  2.735913 -3.249673 0.077343
N  -1.196184 2.625574 -0.220278
N  -4.096798 -1.046387 0.058636
N  -2.691636 0.82691 -0.076438
N  -1.78945 -1.452791 0.063959
N  -0.271008 0.472701 -0.062008
N  0.534036 -1.70225 0.080527
N  1.811936 -1.142349 0.048991
C  -0.185689 4.709715 -0.735573
C  -1.579473 4.964932 -0.102728
C  -5.91498 -2.514817 0.470085
C  -6.442124 -1.239233 -0.23985
C  0.141328 3.255586 -0.318304
C  -2.306233 3.607684 -0.26745
C  -4.395829 -2.494898 0.173585
C  -5.31442 -0.204246 -0.008845
C  -1.393976 1.277227 -0.117171
C  -2.828524 -0.543048 0.015656
C  -0.55794 -0.86905 0.025304
C  2.905312 -1.980131 0.060447
C  4.253545 -1.325207 0.044293
C  5.3738 -2.159382 -0.203046
C  4.459625 0.060631 0.280423
C  6.675651 -1.617896 -0.229935
C  5.763233 0.600515 0.25417
C  6.875039 -0.235424 -0.004761
H  -0.251354 4.780156 -1.836968
H  0.581558 5.423844 -0.392013
H  -1.470389 5.20784 0.970458
H  -2.126984 5.791042 -0.586719
H  -6.088312 -2.441224 1.559678
H  -6.396104 -3.439292 0.109004
H  -6.563296 -1.43048 -1.322185
H  -7.411488 -0.893807 0.157381
H  0.661175 3.214665 0.660102
H  0.768606 2.720567 -1.051996
H  -2.839878 3.537798 -1.23607
H  -3.040965 3.396511 0.527609
H  -4.150442 -3.01354 -0.774125
H  -3.781964 -2.954024 0.96643
H  -5.451177 0.351188 0.940486
H  -5.222497 0.542197 -0.815691
H  0.492381 -2.72283 0.121895
H  1.775161 -0.118262 -0.02558
H  5.191948 -3.226901 -0.364525
H  3.619478 0.725815 0.514058
H  7.533571 -2.270902 -0.424173
H  5.913685 1.669094 0.443668
H  7.886231 0.18605 -0.023256
