program: Gaussian 09
title: 000023191
version: EM64L-G09RevD.01
frameworkgroup: C1[X(C17H16ClN5O2)]
method: RPBEPBE
basis: SDD
operation: Freq
keyword: #p
keyword: freq=noraman
keyword: PBEPBE/SDD
title: #p freq=noraman PBEPBE/SDD
converged: YES YES NO NO
title: Mulliken charges:
elementType: Cl O O N N N N N C C C C C C C C C C C C C C C C C H H H H H H H H H H H H H H H H
charge: -0.010631 -0.262832 -0.262832 -0.413757 -0.413868 -0.143209 -0.033787 -0.033760 0.456159 0.456260 -0.430591 -0.316003 -0.430545 -0.316086 0.316741 0.316760 0.092085 0.092103 -0.333121 -0.357089 -0.333109 -0.357107 -0.306499 -0.536829 -0.536827 0.339884 0.339882 0.233512 0.292533 0.233560 0.292360 0.254429 0.241328 0.254435 0.241352 0.247075 0.217605 0.222866 0.222874 0.217599 0.247081
chargesum: 0.00000
title: Mulliken charges with hydrogens summed into heavy atoms:
elementType: Cl O O N N N N N C C C C C C C C C C C C C C C C C
charge: -0.010631 -0.262832 -0.262832 -0.073873 -0.073986 -0.143209 -0.033787 -0.033760 0.456159 0.456260 -0.197079 -0.023470 -0.196985 -0.023726 0.316741 0.316760 0.092085 0.092103 -0.078692 -0.115761 -0.078674 -0.115755 -0.306499 0.150717 0.150727
polarizability: 4.02360869e+02 1.76758485e-02 3.18570126e+02 1.55597118e-02 2.13293648e+01 1.08909743e+02
1716.lowfreq: -5.3390 -4.1124 -0.0018 -0.0018 -0.0012 3.9648 24.6978 26.4902 27.5484
frequency: 24.6968 26.3456 27.5010 38.9227 66.2860 75.0224 96.6380 96.7696 137.1216 141.8793 155.4867 167.1506 176.7993 206.0867 209.3972 232.5639 241.5952 247.7733 249.0207 280.0385 300.9426 375.8927 376.9196 404.8611 407.1496 414.2721 419.6299 459.4599 460.9499 519.9740 524.9572 540.6024 546.5582 620.1272 623.0723 625.9385 649.5442 657.9196 692.9070 705.2607 717.2983 720.9743 722.0071 734.4704 753.7791 786.2189 802.9208 810.1230 818.4284 829.5109 833.9523 853.4663 877.2228 932.1552 942.4393 946.9596 953.5782 975.0290 987.3981 990.0051 999.1362 1003.4580 1039.5132 1113.5254 1113.6405 1116.6804 1117.1823 1158.1815 1158.2826 1174.5568 1180.9138 1187.1508 1193.0232 1222.2709 1223.7734 1249.0993 1254.4704 1303.9945 1309.0917 1348.4379 1354.8531 1393.6345 1404.7116 1425.0376 1429.1721 1437.5851 1437.6694 1467.2485 1467.2587 1471.4487 1472.5803 1496.1733 1496.7163 1508.8891 1514.3568 1537.1182 1574.2880 1594.6461 1605.2346 1629.0361 1630.5826 2957.2189 2957.6212 3044.5208 3044.5727 3123.6216 3123.6980 3125.4882 3125.5897 3156.9794 3157.3569 3171.6355 3171.6630 3196.4210 3197.1167 3519.6813 3520.5096
redmass: 4.9598 3.4973 4.8014 8.3010 4.3270 5.2200 3.5873 4.1815 5.6655 5.2456 10.3294 5.0345 9.5244 2.9177 2.5734 3.4004 3.9758 1.8445 1.6301 3.8791 5.6423 5.3878 5.3228 13.4605 7.6432 3.0635 3.1650 4.5652 4.6634 2.3932 2.5473 5.6597 5.8862 4.6374 7.0650 7.2687 2.1860 8.1325 1.5540 4.1626 3.0958 3.6091 3.0314 5.2587 5.5085 6.8663 6.9705 1.2587 1.2869 1.7418 1.6265 5.0467 10.8283 6.9238 1.3688 1.3688 1.3410 1.4020 8.6618 6.4719 2.7552 2.3987 6.8773 1.2598 1.2598 1.3549 1.3536 1.3299 1.3283 1.2378 1.2916 3.6775 5.1251 2.5749 2.3067 3.7241 3.6431 1.3833 1.4212 5.1036 3.6864 7.0921 3.7027 3.8564 3.5821 1.1923 1.1971 1.0504 1.0506 1.1000 1.0800 2.6174 2.4299 2.1169 6.8305 2.9684 7.4079 4.9181 4.3989 6.5037 6.3890 1.0331 1.0332 1.1039 1.1038 1.0902 1.0902 1.0991 1.0991 1.0895 1.0894 1.0949 1.0949 1.0943 1.0940 1.0752 1.0753
irintensity: 0.0091 1.6271 0.0745 0.0311 0.1361 1.3786 0.3517 5.6986 8.3731 0.4714 0.9490 6.9848 3.5157 0.0977 0.6803 1.9984 2.9964 0.7545 0.1272 0.0141 0.0368 0.0022 5.0309 18.3197 2.7301 0.0665 0.0516 1.2246 0.8966 56.5809 1.3293 48.8231 41.4965 15.7701 1.1310 1.1378 2.9947 1.0562 92.2727 7.4814 3.4218 1.2264 0.2396 3.0081 12.6547 31.3817 50.2755 0.7524 0.0028 218.3372 0.3570 11.7430 0.8116 116.0480 2.9415 0.5700 1.3662 0.4890 5.4635 85.0173 1.2438 36.7582 1.4971 0.3656 0.0352 2.7835 13.6687 0.7495 1.4496 50.8089 136.8316 121.9669 0.8832 63.2831 479.2973 0.1419 13.7896 8.7119 15.0052 595.7167 30.8024 121.9504 4.3419 34.4260 74.2849 21.1258 50.7110 31.4618 0.3348 71.6570 90.3900 269.7134 621.3117 12.1099 1664.6528 6.0470 410.5386 11.2489 233.7861 7.2443 31.2055 18.9781 103.6456 6.7669 92.2678 4.4979 23.8056 21.9271 30.7185 3.2371 16.3203 12.7115 0.7923 4.8463 2.9112 101.2144 20.2086
temp: 298.150 k
press: 1.00000 atm
elementType: 17 8 8 7 7 7 7 7 6 6 6 6 6 6 6 6 6 6 6 6 6 6 6 6 6 1 1 1 1 1 1 1 1 1 1 1 1 1 1 1 1
symmnumber: 1
zpe: 811189.5 jmol-1
zpe.correction: 0.308966 hartree
zpe.thermalcorrener: 0.331497 hartree
zpe.thermalcorrenthalpy: 0.332441 hartree
zpe.thermalcorrgfe: 0.254872 hartree
zpe.sumelectzpe: -1539.889086 hartree
zpe.sumelectthermal: -1539.866554 hartree
zpe.sumelectthermalent: -1539.865610 hartree
zpe.sumelectthermalfe: -1539.943179 hartree
dipole: 6.4127 -0.0005 0.0029
dipole: 6.4127
quadrupole: -149.5880 -146.1513 -155.6651
quadrupole: -0.0126 0.0225 1.4388
quadrupole: 0.8801 4.3168 -5.1969 -0.0126 0.0225 1.4388
hfenergy: -1540.1980514 hartree
pointgroup: C01 [X(C17H16Cl1N5O2)]
dipole: 2.522937 -0.0038099 0.0012123 debye
polarizability: 402.3607472|-0.1019441|318.8440026|0.050759|19.9366252|108.6359881 unknown
InChI: InChI=1S/C17H16ClN5O2/c1-24-13-7-3-11(4-8-13)19-16-21-15(18)22-17(23-16)20-12-5-9-14(25-2)10-6-12/h3-10,19-20H,1-2H3
charge 0 multiplicity 1
41 atoms
Cl -6.155173 0.007418 -0.001069
O  3.548349 4.325822 -0.11858
O  3.538419 -4.333583 0.11666
N  -1.762765 2.388377 0.131051
N  -1.76841 -2.384081 -0.130677
N  -1.623226 0.001938 0.000698
N  -3.752084 -1.201492 -0.08702
N  -3.749239 1.210475 0.087819
C  -0.395498 2.778403 0.065815
C  -0.402009 -2.777217 -0.065886
C  -0.089173 4.121702 0.424521
C  0.648861 1.92694 -0.368495
C  -0.098341 -4.120179 -0.428052
C  0.643921 -1.929212 0.371387
C  2.270893 3.745217 -0.081477
C  2.262225 -3.750158 0.080385
C  -2.359021 1.153449 0.067025
C  -2.361766 -1.147763 -0.066083
C  1.226796 4.601598 0.351042
C  1.975111 2.407698 -0.440294
C  1.216548 -4.603119 -0.355059
C  1.969106 -2.412976 0.442639
C  -4.337211 0.005162 0.000832
C  4.655743 3.488547 -0.583714
C  4.647305 -3.499967 0.584808
H  -2.451736 3.139739 0.231678
H  -2.459126 -3.133753 -0.231911
H  -0.88753 4.79283 0.764778
H  0.418731 0.900117 -0.655754
H  -0.897926 -4.788613 -0.77071
H  0.415875 -0.902661 0.661281
H  1.469626 5.632644 0.62382
H  2.760028 1.729319 -0.787928
H  1.457328 -5.633938 -0.6305
H  2.755255 -1.737214 0.792566
H  5.543897 4.135764 -0.539961
H  4.801721 2.610608 0.075955
H  4.493291 3.14766 -1.624932
H  4.484992 -3.161748 1.626915
H  4.795484 -2.620438 -0.072246
H  5.534128 -4.148912 0.539675
