program: Gaussian 09
title: 000264680
version: EM64L-G09RevD.01
frameworkgroup: C1[X(C18H21N7O2)]
method: RPBEPBE
basis: SDD
operation: Freq
keyword: #p
keyword: freq=noraman
keyword: PBEPBE/SDD
title: #p freq=noraman PBEPBE/SDD
converged: YES YES NO NO
title: Mulliken charges:
elementType: O O N N N N N N N C C C C C C C C C C C C C C C C C C H H H H H H H H H H H H H H H H H H H H H
charge: -0.232822 -0.243634 -0.156618 -0.143618 -0.382258 -0.134098 -0.015898 -0.087984 -0.110941 -0.367451 -0.369376 0.271341 -0.364785 -0.367138 -0.310957 -0.318555 0.043939 -0.296649 -0.301873 -0.040547 0.107372 0.353792 -0.347803 -0.378356 -0.244433 -0.228291 -0.240858 0.240253 0.236408 0.254246 0.256851 0.249244 0.226149 0.225654 0.283309 0.225792 0.219261 0.197829 0.235711 0.221667 0.194612 0.200601 0.226133 0.247478 0.273990 0.229896 0.230992 0.232423
chargesum: 0.00000
title: Mulliken charges with hydrogens summed into heavy atoms:
elementType: O O N N N N N N N C C C C C C C C C C C C C C C C C C
charge: -0.232822 -0.243634 -0.156618 -0.143618 -0.382258 -0.134098 -0.015898 -0.087984 -0.110941 0.109210 0.141722 0.271341 0.110608 0.141825 0.134097 0.114986 0.043939 0.119629 0.124860 -0.040547 0.107372 0.353792 -0.100325 -0.104366 -0.014537 0.002700 -0.008435
polarizability: 4.03023292e+02 6.55955745e+00 2.32315541e+02 -1.40167643e+01 3.46678109e+01 1.84989563e+02
1716.lowfreq: -10.4511 -4.2734 -0.0005 0.0001 0.0003 10.1895 21.1419 35.8082 46.1229
frequency: 20.6054 35.3534 46.0904 51.6137 54.5116 66.9824 89.1638 94.8520 132.2422 137.8366 174.5085 194.8403 204.0134 221.7234 226.1536 255.6082 281.7425 291.9124 315.8918 328.4367 354.0807 374.9345 396.3988 404.4344 406.7524 430.3959 445.3303 466.7615 474.7113 497.8958 518.1214 529.3631 563.2094 593.3088 609.5523 614.1409 656.6250 663.7523 670.4378 684.5162 695.2046 702.7198 748.5726 772.8072 779.7240 788.9786 795.4052 806.6757 828.4371 834.4921 852.4767 867.9057 901.0127 909.5486 924.8396 935.3184 971.6504 979.2582 987.3749 993.1989 998.4561 1004.7573 1006.2714 1014.5341 1026.4431 1045.9914 1048.9919 1052.5737 1067.4564 1068.8336 1070.5788 1083.6299 1107.2689 1114.4195 1136.5400 1163.5964 1173.7168 1180.3726 1189.5385 1191.1941 1193.1953 1194.8788 1239.8225 1252.9879 1261.7951 1268.9788 1270.6118 1283.3096 1293.3674 1322.6377 1325.1450 1334.0880 1339.8923 1340.0464 1352.8384 1353.6231 1362.8227 1364.0667 1374.5618 1383.4564 1394.9358 1421.1040 1427.5119 1440.6021 1445.7078 1447.4231 1447.6741 1451.3606 1453.7006 1457.8954 1461.9459 1504.1681 1508.4404 1556.5744 1580.1230 1582.5922 1612.4932 2950.2895 2951.6822 2959.4300 2970.2924 2976.0136 2983.0922 3007.3934 3026.5153 3083.6867 3084.6010 3088.6113 3091.6684 3094.8613 3100.1639 3107.6523 3114.0389 3127.4251 3137.8290 3151.5368 3160.3103 3171.1624
redmass: 5.7811 4.6114 4.8009 4.5043 4.6218 3.4646 3.6858 5.2065 5.3771 5.8936 5.8285 4.6466 4.0121 2.3459 5.5776 3.1465 3.1742 5.8210 2.7689 4.2294 4.7143 3.4011 3.3066 2.5509 2.8469 2.5575 3.5910 3.4009 3.4356 5.0874 4.5703 4.8981 9.1456 1.9726 2.1644 5.4978 8.1228 7.8983 8.6146 8.0839 3.6372 2.5532 10.1553 1.9321 5.9527 4.9646 5.0280 4.6526 1.6949 1.6887 1.2508 4.5545 2.5161 2.5255 1.4616 7.1310 3.9335 1.3870 5.8091 3.3365 1.3392 3.5676 3.7493 2.3382 2.3735 2.5004 2.4859 2.6805 3.7009 2.9754 2.6523 1.7075 3.1486 2.3622 4.2990 4.4823 1.0552 2.5375 1.3223 1.1200 1.4225 1.2873 3.4053 1.6086 1.4218 1.3386 1.2276 2.0019 1.8260 1.4245 1.2342 1.2218 1.2324 1.2461 1.3981 1.3759 1.5630 1.3614 4.0239 4.6409 3.2638 3.2048 1.1286 2.4230 1.1397 1.0832 1.0849 1.0971 1.0856 1.0938 1.1011 3.6515 5.1560 7.2080 7.4937 6.9629 5.9984 1.0682 1.0679 1.0682 1.0666 1.0670 1.0662 1.0646 1.0638 1.0965 1.0959 1.0991 1.0960 1.0974 1.0940 1.0988 1.1012 1.0850 1.0883 1.0929 1.0963 1.1007
irintensity: 0.1021 0.8306 0.5438 1.7255 0.5973 0.2151 0.1261 2.5568 3.0327 1.0759 2.3356 2.5681 3.1384 2.6190 1.0739 5.9938 23.8915 0.5353 6.3093 7.1275 0.9912 2.6510 1.3923 5.3037 0.0380 9.6834 3.1754 1.6618 3.9122 7.0090 8.8531 12.1162 8.4613 11.6531 8.3683 0.8260 15.6260 0.4711 20.7874 9.2004 13.9990 27.8093 25.7735 54.4494 0.7170 7.4239 33.5294 18.8501 0.0617 0.3242 0.8507 23.9996 1.0378 2.5358 2.7595 6.1669 20.6236 1.0738 1.1851 19.9948 0.8003 6.2673 112.5852 49.0005 3.9054 26.9787 19.2763 47.2557 15.7380 31.4629 1.5166 12.5168 6.1286 6.8608 42.2934 15.9078 0.1669 71.3022 15.8658 1.3443 16.0789 13.8846 151.3336 28.6678 19.6816 13.9621 5.0282 47.1535 114.2151 0.6980 3.8033 2.3666 21.7628 5.5696 10.0855 10.0772 21.5062 16.3866 1.0669 80.9495 15.5663 12.9287 36.8020 10.6382 57.0186 2.3863 5.9965 34.4535 8.4171 7.6846 38.8495 37.3450 248.8624 1401.2017 284.5358 232.9953 4.2028 39.0732 43.3151 46.9406 27.3200 52.3102 102.5669 30.0730 23.3422 39.2718 27.4278 35.8117 46.1713 5.5412 7.2217 5.0806 4.9248 2.3056 7.2703 27.6652 15.4867 16.6376
temp: 298.150 k
press: 1.00000 atm
elementType: 8 8 7 7 7 7 7 7 7 6 6 6 6 6 6 6 6 6 6 6 6 6 6 6 6 6 6 1 1 1 1 1 1 1 1 1 1 1 1 1 1 1 1 1 1 1 1 1
symmnumber: 1
zpe: 1005127.5 jmol-1
zpe.correction: 0.382833 hartree
zpe.thermalcorrener: 0.405143 hartree
zpe.thermalcorrenthalpy: 0.406087 hartree
zpe.thermalcorrgfe: 0.330149 hartree
zpe.sumelectzpe: -1230.193600 hartree
zpe.sumelectthermal: -1230.171289 hartree
zpe.sumelectthermalent: -1230.170345 hartree
zpe.sumelectthermalfe: -1230.246284 hartree
dipole: -0.6888 6.2575 3.1197
dipole: 7.0259
quadrupole: -148.9780 -181.2874 -156.4906
quadrupole: -0.7302 -3.6027 -3.4595
quadrupole: 13.2740 -19.0354 5.7614 -0.7302 -3.6027 -3.4595
hfenergy: -1230.5764327 hartree
pointgroup: C01 [X(C18H21N7O2)]
dipole: 0.5818783 -2.2642867 1.4748901 debye
polarizability: 402.0685441|16.6861763|224.9720432|-5.3337875|-40.3526031|193.2878084 unknown
InChI: InChI=1S/C18H21N7O2/c1-2-4-14(5-3-1)15-21-22-17-19-16(23-6-10-26-11-7-23)20-18(25(15)17)24-8-12-27-13-9-24/h1-5H,6-13H2
charge 0 multiplicity 1
48 atoms
O  1.527483 -4.197605 -0.872591
O  -5.964938 -0.129958 1.545862
N  0.965859 -1.519324 0.074951
N  -3.56414 -0.206872 -0.015989
N  0.353895 0.691906 -0.710958
N  -1.290853 -0.84045 0.049109
N  -2.019195 1.144856 -1.163885
N  -0.173694 2.537173 -1.977634
N  1.212869 2.518828 -1.714657
C  0.604506 -2.713815 0.882614
C  2.123532 -1.774868 -0.8277
C  0.000671 -0.568883 -0.188193
C  -3.958908 -1.382684 0.781564
C  -4.685157 0.65776 -0.440555
C  0.348947 -3.931248 -0.028055
C  1.834797 -3.020146 -1.697314
C  -2.262655 0.066514 -0.372179
C  -4.80509 -0.922193 1.986289
C  -5.514685 1.058382 0.795026
C  -0.713205 1.467372 -1.334017
C  1.535427 1.446411 -0.946877
C  2.858091 1.289637 -0.323824
C  3.028438 0.741901 0.977779
C  3.996434 1.786923 -1.018489
C  4.313731 0.670338 1.557023
C  5.276354 1.713903 -0.433953
C  5.443536 1.149026 0.853771
H  -0.287498 -2.483317 1.48441
H  1.461699 -2.929022 1.548696
H  3.022132 -1.943075 -0.207987
H  2.314111 -0.905882 -1.474355
H  -3.050586 -1.911936 1.107656
H  -4.565085 -2.063321 0.14917
H  -5.325106 0.097125 -1.151465
H  -4.268589 1.538358 -0.954602
H  0.200524 -4.846889 0.56723
H  -0.543923 -3.748844 -0.661933
H  0.990786 -2.811976 -2.390865
H  2.729103 -3.293059 -2.281295
H  -5.226816 -1.78622 2.525652
H  -4.177394 -0.320077 2.678919
H  -4.910626 1.714316 1.458053
H  -6.436511 1.583136 0.496832
H  2.158786 0.392013 1.543184
H  3.85245 2.237922 -2.005357
H  4.4311 0.253754 2.563704
H  6.14436 2.098855 -0.980327
H  6.439532 1.092456 1.306462
