program: Gaussian 09
title: 000256545
version: EM64L-G09RevD.01
frameworkgroup: C1[X(C16H13ClO)]
method: RPBEPBE
basis: SDD
operation: Freq
keyword: #p
keyword: freq=noraman
keyword: PBEPBE/SDD
title: #p freq=noraman PBEPBE/SDD
converged: YES YES NO NO
title: Mulliken charges:
elementType: Cl O C C C C C C C C C C C C C C C C H H H H H H H H H H H H H
charge: -0.047012 -0.250168 0.485871 0.424946 -0.555651 -0.390466 -0.266963 0.306747 -0.368681 -0.227588 -0.313885 0.099871 -0.806538 -0.327161 -0.340244 -0.229380 -0.222974 -0.103543 0.240647 0.227818 0.269243 0.235975 0.228537 0.206512 0.228149 0.229355 0.238585 0.224265 0.286839 0.257087 0.259805
chargesum: 0.00000
title: Mulliken charges with hydrogens summed into heavy atoms:
elementType: Cl O C C C C C C C C C C C C C C C C
charge: -0.047012 -0.250168 0.485871 0.424946 -0.315004 -0.162648 0.002280 0.306747 -0.132706 0.000950 -0.107373 0.099871 -0.110449 -0.102896 -0.053405 0.027708 0.036831 -0.103543
polarizability: 4.07874503e+02 -4.64527524e+00 1.86233164e+02 1.83354212e-01 2.21927410e-01 7.45334621e+01
1716.lowfreq: -32.6970 -1.5240 -0.0026 -0.0020 -0.0016 3.5071 3.8375 14.1100 22.4187
frequency: -32.2059 13.2775 22.3831 43.6925 75.1925 89.6829 131.8431 140.7526 186.0995 205.6894 245.0120 267.9270 280.9653 309.7514 319.1202 390.9648 406.1394 435.4177 473.0703 496.4443 510.9691 517.1131 540.6537 585.3964 623.0892 666.2638 693.6118 698.6235 739.0202 742.3367 800.2659 824.5429 848.7432 850.9228 880.7814 897.8284 923.3046 924.8718 954.5830 986.6089 987.6744 994.7537 997.8893 998.0288 1016.0041 1033.2379 1050.6689 1072.5038 1100.3579 1110.5168 1181.3198 1184.3311 1188.5898 1222.1682 1250.0157 1286.1735 1309.3829 1323.7449 1334.3841 1371.3303 1385.8301 1396.3900 1399.0948 1420.1446 1471.4448 1473.4515 1475.1244 1488.9479 1514.6393 1579.8497 1589.9607 1594.0645 1612.0621 1635.3113 2978.8560 3060.1459 3088.7324 3095.5583 3118.4075 3122.5241 3137.0552 3146.6885 3155.6396 3157.6761 3159.8766 3174.0436 3177.9247
redmass: 1.0245 3.5961 5.1599 6.3576 6.0653 6.3208 3.3087 5.7364 7.6957 2.9274 6.5202 4.3219 3.8738 8.2642 3.8243 4.3930 2.8526 2.8084 3.2639 6.4797 4.9930 5.4197 3.1907 6.6377 7.1584 3.6610 7.3317 2.0541 2.6269 6.1632 1.5610 1.3935 5.4158 1.4564 1.8578 1.4034 1.5729 2.3975 1.3957 1.4207 5.0986 2.4815 1.5987 1.7427 1.2330 3.1214 1.5728 2.7678 1.5854 1.3782 1.2479 1.2663 1.2486 1.8846 2.5407 1.2979 1.9057 1.5101 1.6200 4.5492 6.4878 3.8500 1.2723 2.5591 1.1005 1.3645 2.0922 1.9568 10.5859 7.5576 5.4885 6.2273 5.9510 5.5323 1.0383 1.0959 1.0996 1.0892 1.0911 1.0873 1.0911 1.0902 1.0886 1.0928 1.0934 1.0960 1.0971
irintensity: 0.5727 0.0253 0.3149 0.0674 1.8060 1.1735 0.0567 2.0097 0.1754 2.1581 3.0469 2.1269 1.3148 1.0655 2.5878 22.9880 0.0147 4.0675 15.4414 20.1795 1.0239 21.4441 1.1451 14.1290 2.3234 21.3328 2.6402 15.1740 1.7529 18.6955 68.2738 7.1472 20.4668 54.9428 3.8131 0.3348 0.1056 0.3247 0.4820 1.0229 12.3592 47.1399 14.7974 21.8025 36.9286 64.4085 20.9051 73.1891 9.1272 25.4948 84.8949 0.3030 1.2724 141.4897 157.8279 1.0713 31.8531 122.3025 16.6290 17.2790 28.6555 8.9424 6.7293 64.2915 16.5771 14.2776 20.4009 17.0697 196.3732 51.6757 78.7166 167.6740 15.4292 312.1763 36.1346 20.6149 14.5152 0.5532 10.1520 6.0435 19.0881 4.4023 0.6728 3.4849 32.0176 10.9657 3.9731
temp: 298.150 k
press: 1.00000 atm
elementType: 17 8 6 6 6 6 6 6 6 6 6 6 6 6 6 6 6 6 1 1 1 1 1 1 1 1 1 1 1 1 1
symmnumber: 1
zpe: 624244.2 jmol-1
zpe.correction: 0.237762 hartree
zpe.thermalcorrener: 0.253426 hartree
zpe.thermalcorrenthalpy: 0.254371 hartree
zpe.thermalcorrgfe: 0.191492 hartree
zpe.sumelectzpe: -1151.531322 hartree
zpe.sumelectthermal: -1151.515658 hartree
zpe.sumelectthermalent: -1151.514714 hartree
zpe.sumelectthermalfe: -1151.577593 hartree
dipole: 3.6684 -2.5920 0.0570
dipole: 4.4921
quadrupole: -96.8462 -107.4058 -118.1996
quadrupole: -2.8890 0.2985 0.0659
quadrupole: 10.6377 0.0781 -10.7157 -2.8890 0.2985 0.0659
hfenergy: -1151.7690843 hartree
pointgroup: C01 [X(C16H13Cl1O1)]
dipole: -1.4750086 0.9623321 0.1474037 debye
polarizability: 407.8833657|1.6689135|183.7075036|4.8883772|16.3641196|77.0502597 unknown
InChI: InChI=1S/C16H13ClO/c1-12-3-2-4-13(11-12)5-10-16(18)14-6-8-15(17)9-7-14/h2-11H,1H3
charge 0 multiplicity 1
31 atoms
Cl 6.820859 1.155372 0.234075
O  0.973209 -2.297762 -0.380217
C  -2.638599 0.018523 -0.076476
C  -5.118272 -0.135385 -0.14385
C  -3.840063 -0.735777 -0.217801
C  -2.742554 1.423332 0.143435
C  -1.35823 -0.690576 -0.168672
C  2.474157 -0.441062 -0.073662
C  -5.186936 1.265992 0.072272
C  -4.007458 2.035193 0.215706
C  -0.095883 -0.163849 -0.066901
C  1.094989 -1.040926 -0.185402
C  -6.384153 -0.964701 -0.272638
C  2.725281 0.942714 0.133013
C  3.583447 -1.324273 -0.184009
C  4.044682 1.435006 0.227379
C  4.905706 -0.851761 -0.09228
C  5.115814 0.527876 0.113161
H  -3.764176 -1.817376 -0.390235
H  -1.839322 2.032788 0.254358
H  -1.406739 -1.776766 -0.340014
H  -6.166544 1.756422 0.12733
H  -4.082063 3.115786 0.380854
H  0.049758 0.907192 0.103077
H  -7.149331 -0.443126 -0.874989
H  -6.183364 -1.940586 -0.746779
H  -6.830377 -1.16395 0.720763
H  1.903193 1.658492 0.223006
H  3.375757 -2.387273 -0.343082
H  4.236085 2.49998 0.386083
H  5.755526 -1.534718 -0.177604
