program: Gaussian 09
title: 000264618
version: EM64L-G09RevD.01
frameworkgroup: C1[X(C14H12N2O4)]
method: RPBEPBE
basis: SDD
operation: Freq
keyword: #p
keyword: freq=noraman
keyword: PBEPBE/SDD
title: #p freq=noraman PBEPBE/SDD
converged: NO YES NO NO
title: Mulliken charges:
elementType: O O O O N N C C C C C C C C C C C C C C H H H H H H H H H H H H
charge: -0.301546 -0.218132 -0.201231 -0.239033 -0.404164 0.016030 0.193812 -0.455534 0.318616 0.467273 -0.475220 -0.268719 0.431105 -0.415686 -0.386489 -0.387407 -0.224356 -0.224492 -0.226277 -0.068237 0.226793 0.226826 0.357398 0.262268 0.287471 0.238037 0.237836 0.349122 0.234886 0.234956 0.237080 0.177011
chargesum: 0.00000
title: Mulliken charges with hydrogens summed into heavy atoms:
elementType: O O O O N N C C C C C C C C C C C C C C
charge: -0.301546 -0.218132 -0.201231 -0.239033 -0.055041 0.016030 0.193812 -0.001915 0.318616 0.467273 -0.117822 -0.006451 0.431105 -0.128215 -0.148452 -0.149571 0.010530 0.010464 0.010804 0.108774
polarizability: 2.88481909e+02 -2.18826648e+01 1.80444593e+02 9.87122265e-02 1.62974219e-01 1.14323278e+02
1716.lowfreq: -3.1699 -0.0011 -0.0008 -0.0005 5.5294 5.6532 10.5941 23.8034 43.4674
frequency: 10.4191 23.5608 43.4649 49.8646 70.8439 89.1358 121.8722 130.3454 136.0604 170.9473 206.3778 235.8403 297.2979 298.6936 339.2909 362.8035 374.9678 401.9533 435.2224 468.9615 476.0509 521.1084 556.0803 564.9697 574.2439 617.2732 638.8730 698.8532 701.8301 731.3085 735.2398 742.2085 752.6546 773.6771 818.4005 827.0119 846.7964 854.9780 909.3398 923.2043 940.8042 948.9031 958.3362 966.2467 974.1564 979.8157 991.0816 1002.5967 1026.8054 1060.8558 1091.4542 1112.8824 1136.2523 1175.8382 1187.8820 1192.7676 1195.4176 1213.5603 1227.4808 1256.2955 1266.4199 1327.3929 1353.0738 1365.3704 1375.3101 1388.0373 1408.0452 1435.5709 1442.4812 1470.6675 1483.0903 1488.2250 1517.0337 1597.4228 1601.6981 1604.8156 1617.1876 1637.4475 2946.2706 2981.7340 3047.6122 3126.1065 3126.6340 3140.0779 3153.8409 3169.4232 3170.0958 3191.6418 3197.5735 3490.3723
redmass: 4.0895 5.7126 6.1155 14.2662 5.1190 5.4823 9.9084 6.4049 7.3773 3.3225 6.2712 10.0305 4.4967 6.0986 2.3693 8.2133 3.6738 2.7918 9.0889 3.3805 4.2991 6.2471 4.5708 5.2026 6.0149 6.3401 7.3770 4.7235 1.9581 4.6591 1.4203 3.4298 2.6948 3.1262 1.4993 5.8825 3.7937 1.2467 4.9036 3.0882 2.3411 1.5916 1.3784 1.4015 1.5387 1.3932 6.2423 1.3262 2.1820 2.0064 1.5078 4.4772 1.4898 1.0546 1.2518 1.8582 1.0860 7.7224 2.3647 1.9264 1.9870 1.2710 1.4761 4.7630 1.4549 8.4957 4.2397 4.1810 2.1829 1.9563 1.3709 2.2686 2.6784 6.0963 5.9382 7.9902 6.1905 5.1680 1.0870 1.0561 1.1085 1.0865 1.0888 1.0915 1.0961 1.1014 1.0887 1.0959 1.0934 1.0770
irintensity: 0.5725 1.0411 0.6753 0.4686 1.0481 1.5365 0.7066 5.3547 8.9581 12.3292 0.6143 8.5385 5.6674 0.0636 3.8412 0.6896 2.7994 0.0023 6.6612 2.5030 2.0117 8.8418 17.0010 0.0505 5.6786 0.0568 33.9524 11.4657 46.6712 13.5589 77.5329 49.7804 13.0241 31.8319 38.8708 11.3945 28.9671 0.0538 47.1820 131.6887 51.9995 4.5308 0.8399 37.6742 0.5276 0.0002 1.6580 0.0051 4.2298 95.4164 7.0417 10.1896 108.0247 0.0001 58.6218 99.6458 1.6948 457.3517 10.5282 144.8229 140.4427 0.2635 37.6282 65.0703 5.7042 0.9318 30.0468 180.9180 10.0434 88.9107 13.6896 13.3674 342.1989 0.8571 124.7474 101.5566 1.3181 126.2821 103.6480 30.3816 17.9576 6.2944 3.2282 10.1688 30.6832 21.1521 7.1955 4.4902 22.0585 69.4071
temp: 298.150 k
press: 1.00000 atm
elementType: 8 8 8 8 7 7 6 6 6 6 6 6 6 6 6 6 6 6 6 6 1 1 1 1 1 1 1 1 1 1 1 1
symmnumber: 1
zpe: 623805.5 jmol-1
zpe.correction: 0.237595 hartree
zpe.thermalcorrener: 0.254960 hartree
zpe.thermalcorrenthalpy: 0.255904 hartree
zpe.thermalcorrgfe: 0.188697 hartree
zpe.sumelectzpe: -949.588112 hartree
zpe.sumelectthermal: -949.570746 hartree
zpe.sumelectthermalent: -949.569802 hartree
zpe.sumelectthermalfe: -949.637009 hartree
dipole: -11.3323 -2.2004 0.0090
dipole: 11.5439
quadrupole: -144.3034 -119.5537 -109.4363
quadrupole: -7.4054 0.0458 0.0784
quadrupole: -19.8722 4.8774 14.9948 -7.4054 0.0458 0.0784
hfenergy: -949.8257065 hartree
pointgroup: C01 [X(C14H12N2O4)]
dipole: -4.4320148 0.8821471 -0.4543406 debye
polarizability: 289.015012|20.8571591|176.0364964|3.3916474|-14.6158144|118.1982718 unknown
InChI: InChI=1S/C14H12N2O4/c17-10-15-13-8-12(16(18)19)6-7-14(13)20-9-11-4-2-1-3-5-11/h1-8,10,15H,9H2
charge 0 multiplicity 1
32 atoms
O  -0.895879 0.158148 -0.0656
O  5.254473 1.888161 -0.198688
O  5.42401 -0.313283 0.373795
O  2.279789 -3.472956 1.034789
N  0.552263 -1.939409 0.54585
N  4.733576 0.734042 0.070703
C  0.481335 0.400959 -0.058073
C  -1.816839 1.2874 -0.401853
C  1.270588 -0.750433 0.277155
C  -3.228202 0.760015 -0.338682
C  2.675686 -0.641531 0.319992
C  1.094102 1.638885 -0.34523
C  3.259262 0.612623 0.027585
C  2.497386 1.751237 -0.303142
C  -3.834451 0.193562 -1.488224
C  -3.959482 0.81343 0.874587
C  -5.150602 -0.315026 -1.42562
C  -5.275821 0.305626 0.939912
C  -5.873355 -0.259522 -0.210926
C  1.062121 -3.186015 0.892971
H  -1.558285 1.650526 -1.415146
H  -1.648667 2.098119 0.332921
H  3.294978 -1.504109 0.572352
H  0.492779 2.514722 -0.601097
H  3.005209 2.693832 -0.519655
H  -3.275292 0.149834 -2.430683
H  -3.497221 1.251071 1.767692
H  -0.466727 -1.844763 0.469657
H  -5.612332 -0.748827 -2.319044
H  -5.834332 0.352946 1.880853
H  -6.895641 -0.65035 -0.162576
H  0.245073 -3.926414 1.046826
