program: Gaussian 09
title: 000023202
version: EM64L-G09RevD.01
frameworkgroup: C1[X(C17H20ClNO2)]
method: RPBEPBE
basis: SDD
operation: Freq
keyword: #p
keyword: freq=noraman
keyword: PBEPBE/SDD
title: #p freq=noraman PBEPBE/SDD
converged: NO YES NO NO
title: Mulliken charges:
elementType: Cl O O N C C C C C C C C C C C C C C C C C H H H H H H H H H H H H H H H H H H H H
charge: -0.061657 -0.279137 -0.248510 -0.053890 -0.148260 -0.154948 -0.443802 -0.446258 -0.510229 -0.493585 0.029111 -0.645618 0.133142 0.211144 0.328903 -0.628614 -0.365252 -0.366987 -0.202530 -0.203438 -0.105261 0.235129 0.233626 0.197575 0.229210 0.230013 0.204828 0.218699 0.231204 0.219872 0.241127 0.255200 0.195398 0.226716 0.226766 0.263154 0.242888 0.246103 0.246248 0.255993 0.255926
chargesum: 0.00000
title: Mulliken charges with hydrogens summed into heavy atoms:
elementType: Cl O O N C C C C C C C C C C C C C C C C C
charge: -0.061657 -0.279137 -0.248510 -0.053890 0.086869 0.078678 -0.017017 -0.011416 -0.060326 -0.032586 0.284312 0.003262 0.133142 0.211144 0.328903 -0.122572 -0.119150 -0.120738 0.053463 0.052488 -0.105261
polarizability: 2.17156810e+02 -2.20282879e+01 2.16747845e+02 1.67968948e+00 -1.28894718e+00 1.63222308e+02
1716.lowfreq: -48.0664 -7.1187 -0.0021 -0.0017 -0.0017 0.2671 3.8590 24.8223 27.6044
frequency: -48.0506 22.4119 25.3407 44.7644 58.3392 70.5928 110.3250 134.5977 158.0721 182.7256 215.5266 218.1520 248.9266 266.9215 279.4485 284.2864 317.4657 347.0927 364.6160 373.1253 401.4527 402.0393 444.7299 469.9543 479.8071 493.2981 500.2315 542.0877 580.4340 621.3128 666.4202 673.9255 691.7030 720.6281 732.8891 760.5984 780.2451 781.9024 792.6499 818.0226 828.1716 830.8761 857.7400 866.2273 878.9772 916.8794 927.7406 948.9078 962.4782 963.9119 970.4699 996.6201 997.5234 999.1783 1032.4770 1041.0722 1069.9125 1085.5121 1087.1833 1104.5618 1112.8039 1118.7918 1140.3724 1147.3918 1148.5732 1169.0045 1183.5469 1198.7927 1220.0232 1229.0493 1244.7018 1257.3502 1271.1776 1276.5332 1289.2615 1290.1496 1298.6948 1315.2043 1315.9545 1333.3250 1353.2259 1353.4243 1357.4799 1386.0940 1406.1194 1430.3590 1460.7699 1462.0156 1471.0350 1477.1248 1485.1322 1491.0471 1496.5245 1578.6029 1590.1142 1600.9796 1643.0165 2883.2863 2995.5982 2997.0402 3009.5880 3014.6211 3020.1030 3027.1089 3027.6668 3037.7882 3055.8697 3063.9773 3067.7055 3070.0426 3091.7506 3101.7103 3143.5353 3145.3338 3169.4905 3173.2466 3217.2695
redmass: 3.7947 4.1693 6.5468 4.5713 6.5608 5.1830 6.3062 5.2076 4.1257 1.9137 1.5259 2.0778 4.5824 4.4770 5.2634 2.1607 5.4922 4.7013 3.6154 2.1523 3.3001 2.9321 3.0138 5.7264 3.9895 4.2015 3.7968 3.1916 4.1682 6.1255 4.9742 3.4655 1.8747 3.4452 4.5764 4.6972 3.3730 2.1238 1.7767 2.4271 1.2452 1.6096 2.2881 3.0238 1.5634 3.6037 3.9911 1.3487 2.2111 1.3675 2.1530 1.3563 1.7228 4.3753 2.2595 1.5302 3.1184 1.9031 1.9106 1.3600 1.1578 1.4088 3.2077 3.1078 1.8790 1.4211 1.1189 1.6150 1.9251 1.5087 1.3717 1.4499 1.4430 1.4617 2.7231 1.2513 1.4758 1.4496 1.3639 1.5703 1.4669 5.0541 1.5433 3.6121 1.2225 1.1485 1.0705 1.0782 1.0794 2.4521 1.0889 1.0907 1.0533 7.7188 7.8908 8.0438 6.1759 1.0541 1.0603 1.0614 1.0606 1.0748 1.0682 1.0859 1.0857 1.0844 1.1018 1.1012 1.1036 1.1005 1.1043 1.0615 1.0894 1.0893 1.0961 1.0972 1.1160
irintensity: 0.3140 0.1192 0.1028 1.2094 2.1126 0.1346 0.3207 0.2993 5.4044 0.1741 0.5029 0.6943 0.5017 0.3558 1.1276 0.0670 0.8377 5.2308 5.3310 0.8734 4.1197 0.3220 15.9319 12.8970 1.0365 22.3843 13.0772 0.6245 9.5431 0.3026 6.7336 18.1628 6.0648 8.3453 1.5330 15.7099 3.1937 8.1253 10.3556 3.7155 0.2035 48.6902 8.8053 12.2246 1.5031 22.7663 79.2966 2.7486 17.9170 0.0629 4.7847 49.7898 1.5029 47.7272 63.3073 13.3007 28.7349 76.0042 57.8265 8.6867 10.5155 1.4634 193.1330 169.7397 34.1595 1.1179 0.1005 4.6348 24.8801 4.2188 10.4224 1.3699 0.1878 16.8019 112.0246 0.1772 2.3213 7.5501 1.4734 6.7452 2.6232 0.4463 1.5018 4.0483 28.9700 6.8266 9.4645 8.2490 9.9220 73.9830 22.2053 6.3059 0.9657 0.7975 47.8156 125.1314 2.9297 90.9602 13.3998 19.8804 10.1187 62.2421 48.1084 39.3392 65.2815 10.7761 24.3275 39.5669 0.4258 26.7383 69.1729 2.9636 4.9237 5.9914 7.4748 0.2778 3.2641
temp: 298.150 k
press: 1.00000 atm
elementType: 17 8 8 7 6 6 6 6 6 6 6 6 6 6 6 6 6 6 6 6 6 1 1 1 1 1 1 1 1 1 1 1 1 1 1 1 1 1 1 1 1
symmnumber: 1
zpe: 875427.1 jmol-1
zpe.correction: 0.333433 hartree
zpe.thermalcorrener: 0.352065 hartree
zpe.thermalcorrenthalpy: 0.353009 hartree
zpe.thermalcorrgfe: 0.284935 hartree
zpe.sumelectzpe: -1323.483294 hartree
zpe.sumelectthermal: -1323.464661 hartree
zpe.sumelectthermalent: -1323.463717 hartree
zpe.sumelectthermalfe: -1323.531791 hartree
dipole: -0.5931 0.0125 -0.0431
dipole: 0.5948
quadrupole: -139.7331 -136.6679 -121.4566
quadrupole: 9.6157 -0.5722 0.5600
quadrupole: -7.1139 -4.0487 11.1626 9.6157 -0.5722 0.5600
hfenergy: -1323.8167265 hartree
pointgroup: C01 [X(C17H20Cl1N1O2)]
dipole: -0.2321284 -0.0296664 0.0019762 debye
polarizability: 212.7069867|21.1859076|219.4673822|4.482773|10.0064596|164.9525942 unknown
InChI: InChI=1S/C17H20ClNO2/c1-11(12-3-5-13(18)6-4-12)17(20)21-16-9-14-7-8-15(10-16)19(14)2/h3-6,14-16H,1,7-10H2,2H3
charge 0 multiplicity 1
41 atoms
Cl 5.093876 2.997146 0.70633
O  -0.190124 -0.658036 -0.303917
O  -0.534226 -2.962598 -0.483629
N  -3.728223 1.529782 0.534168
C  -3.33461 1.440751 -0.902028
C  -3.756043 0.099605 0.955015
C  -4.350164 0.378241 -1.421797
C  -4.636794 -0.524029 -0.168141
C  -1.852871 0.961064 -1.065734
C  -2.318362 -0.521042 0.977779
C  -1.676753 -0.42279 -0.421932
C  -3.021515 2.493281 1.390042
C  0.238961 -1.981898 -0.334814
C  1.734347 -2.072856 -0.173458
C  2.539261 -0.823817 0.038208
C  2.298729 -3.310437 -0.220947
C  3.080709 -0.116443 -1.064817
C  2.787191 -0.341776 1.34859
C  3.859112 1.046821 -0.870864
C  3.563485 0.819592 1.561506
C  4.087184 1.49612 0.443599
H  -3.459827 2.422256 -1.393516
H  -4.215017 0.004915 1.955598
H  -3.944424 -0.194604 -2.275168
H  -5.273615 0.87708 -1.759458
H  -5.700828 -0.465461 0.11477
H  -4.389611 -1.586631 -0.34138
H  -1.57715 0.920572 -2.135885
H  -1.169567 1.682215 -0.578441
H  -1.690011 0.031086 1.703219
H  -2.358906 -1.576899 1.301495
H  -2.072894 -1.223572 -1.07241
H  -1.925403 2.316904 1.509196
H  -3.47434 2.480453 2.398169
H  -3.153196 3.509406 0.975581
H  1.669647 -4.195077 -0.373479
H  3.37879 -3.449418 -0.108968
H  2.895213 -0.474897 -2.082842
H  2.374495 -0.877232 2.21031
H  4.278712 1.588641 -1.723384
H  3.756761 1.186883 2.573532
