program: Gaussian 09
title: 000264677
version: EM64L-G09RevD.01
frameworkgroup: C1[X(C18H23N7O3)]
method: RPBEPBE
basis: SDD
operation: Freq
keyword: #p
keyword: freq=noraman
keyword: PBEPBE/SDD
title: #p freq=noraman PBEPBE/SDD
converged: YES YES NO NO
title: Mulliken charges:
elementType: O O O N N N N N N N C C C C C C C C C C C C C C C C C C H H H H H H H H H H H H H H H H H H H H H H H
charge: -0.244724 -0.245348 -0.318834 -0.149722 -0.147767 -0.191533 -0.156629 -0.256521 -0.287283 -0.345637 -0.363921 -0.359705 -0.368475 -0.367849 -0.300673 -0.298048 -0.300655 -0.298500 0.176076 0.146653 0.094504 0.184383 0.277342 -0.348431 -0.348499 -0.219409 -0.235643 -0.227693 0.223000 0.261058 0.244066 0.223984 0.222225 0.271611 0.257005 0.223317 0.221152 0.197352 0.196888 0.220640 0.221802 0.197873 0.195428 0.219775 0.363677 0.357399 0.276628 0.212107 0.233067 0.229410 0.233077
chargesum: 0.00000
title: Mulliken charges with hydrogens summed into heavy atoms:
elementType: O O O N N N N N N N C C C C C C C C C C C C C C C C C C
charge: -0.244724 -0.245348 -0.318834 -0.149722 -0.147767 -0.191533 -0.156629 -0.256521 0.076394 0.011762 0.120138 0.108344 0.125361 0.112474 0.117832 0.119479 0.119021 0.116702 0.176076 0.146653 0.094504 0.184383 0.277342 -0.071803 -0.136391 0.013658 -0.006233 0.005384
polarizability: 4.29460666e+02 -7.80115586e+00 3.03209993e+02 -1.40650351e+01 -1.35506135e+01 1.40878969e+02
1716.lowfreq: -6.8298 -1.8419 -0.0007 0.0003 0.0005 3.4305 14.4800 21.6293 28.6368
frequency: 14.1267 21.5543 28.5079 30.6443 45.5304 49.1367 59.1192 75.1532 86.3841 110.1431 131.3569 162.6178 175.8619 184.6315 189.5967 198.6605 222.0515 249.2374 262.3161 271.0065 281.4660 299.4332 315.1804 340.7141 394.1710 399.1187 399.7882 405.3628 428.0482 448.1510 458.2176 468.4916 497.5655 520.4906 529.6681 574.6932 579.8282 592.7196 606.2354 615.0065 621.8272 666.3158 671.6848 686.6183 692.9837 694.2399 698.9551 772.1545 782.3536 786.8031 791.3729 803.6466 833.4886 835.1845 851.9603 853.5683 893.6230 900.7435 904.0766 914.7421 932.7749 983.2860 983.4962 989.3921 1005.6351 1006.9886 1013.7665 1016.9494 1023.6479 1049.4180 1049.9615 1055.2108 1069.3386 1070.3558 1075.6886 1089.0327 1093.5575 1119.6146 1133.3353 1173.5496 1183.8511 1185.5748 1189.7527 1191.3235 1193.2135 1208.3362 1240.6918 1252.9085 1259.8297 1269.5738 1270.6888 1274.0464 1284.8679 1292.9560 1319.2064 1323.1309 1324.2809 1324.7819 1341.1212 1342.8710 1352.4916 1353.7426 1364.3725 1366.1205 1385.8774 1423.3067 1435.4510 1446.3501 1446.7659 1448.2630 1450.3133 1450.8104 1453.3549 1455.1829 1456.5942 1459.7856 1465.9882 1488.5107 1520.7622 1544.1443 1560.2573 1597.1898 1608.6526 1615.2224 2950.9920 2952.6907 2955.7254 2956.7815 2974.6642 2977.3518 2978.1267 2981.8074 3083.5241 3084.0871 3086.8957 3087.4355 3096.2893 3097.6387 3098.1125 3098.3574 3119.0592 3132.7703 3145.7139 3158.6740 3170.3402 3495.2397 3545.2132
redmass: 3.9057 5.6252 5.3436 5.1383 4.0959 4.9652 3.6816 6.6377 4.1950 5.5965 5.8254 5.7328 3.9808 6.1881 5.0084 9.0204 2.6255 4.0942 3.2029 2.7975 6.1616 3.2402 3.5553 6.5441 1.9631 2.8400 2.0941 4.6765 3.8707 3.5633 3.0620 3.1695 4.8614 4.3383 5.1505 1.8436 2.0798 1.2279 2.0272 6.0543 2.1195 6.4944 6.2531 4.2402 7.5613 6.0085 1.7076 10.9829 4.8777 2.1893 4.3945 3.9420 1.6868 1.6873 1.2682 5.5792 8.4759 2.5522 2.6633 3.3393 1.4296 2.9926 1.4084 5.7197 2.8815 1.3391 2.2973 2.3190 2.5303 2.4259 2.3965 2.4202 3.0268 3.2478 2.2037 2.2543 2.0453 2.2490 2.3589 1.0631 2.4912 1.6158 1.1190 1.1730 1.3172 2.8009 1.4476 1.6829 1.6704 1.7936 1.3087 1.6718 2.1713 2.5834 1.5135 1.2684 1.6128 1.2764 1.2589 1.2442 1.4940 1.4404 1.2644 1.2604 8.6467 3.4977 2.6243 1.0939 1.1497 1.1594 1.2868 1.0996 1.0957 1.6517 1.1926 1.3499 3.5964 2.6654 4.6976 3.7503 7.2349 6.1389 6.7692 6.7998 1.0681 1.0682 1.0680 1.0682 1.0668 1.0667 1.0670 1.0669 1.0961 1.0961 1.0981 1.0977 1.0946 1.0935 1.0950 1.0945 1.0871 1.0872 1.0922 1.0958 1.1006 1.0795 1.0789
irintensity: 0.0079 0.5386 0.7759 0.6203 0.1951 2.3062 0.0925 0.9242 0.0369 0.3389 3.9211 4.1296 2.1250 0.5040 3.4836 0.4325 4.4734 18.2379 11.2000 2.1732 0.7408 3.2133 18.2226 1.9218 1.6896 0.4398 0.8392 0.8195 3.0686 6.9494 1.6680 0.7642 3.5530 18.6383 48.4478 37.7067 6.4615 130.3780 9.7793 0.7459 23.0485 1.0520 25.3008 16.9478 0.9384 4.1402 80.6775 21.5944 3.4684 34.7446 13.0825 49.6894 0.4944 0.0571 1.9564 25.1341 1.8054 2.2847 1.3545 9.1096 3.8328 58.6601 2.1998 0.3289 17.6088 1.3997 49.7565 33.1646 14.8653 27.8569 53.1235 11.1258 24.7007 28.9028 1.7489 5.1896 20.8451 0.9356 17.8640 1.4232 6.0771 4.8579 12.5247 2.5103 2.1502 0.8851 77.2416 173.5467 87.2531 12.0111 8.5751 42.2113 176.7861 45.0193 14.7931 4.7746 25.0467 9.0147 10.5128 14.5715 30.4440 19.6667 1.0343 0.7564 5.3841 213.5628 24.1742 29.1559 176.2967 73.8342 390.0244 37.4487 19.8725 520.5455 153.6156 161.0705 529.4919 380.4200 1493.9524 469.9991 204.8862 12.6389 62.3533 64.7524 38.3460 44.8170 30.4797 70.1633 9.0635 19.7154 113.7064 141.8445 35.5043 41.2529 60.5477 40.2955 2.0110 7.3996 4.9543 15.2388 12.8881 1.5501 24.6616 14.9892 23.8728 116.8402 205.9817
temp: 298.150 k
press: 1.00000 atm
elementType: 8 8 8 7 7 7 7 7 7 7 6 6 6 6 6 6 6 6 6 6 6 6 6 6 6 6 6 6 1 1 1 1 1 1 1 1 1 1 1 1 1 1 1 1 1 1 1 1 1 1 1
symmnumber: 1
zpe: 1076419.8 jmol-1
zpe.correction: 0.409987 hartree
zpe.thermalcorrener: 0.434883 hartree
zpe.thermalcorrenthalpy: 0.435827 hartree
zpe.thermalcorrgfe: 0.351800 hartree
zpe.sumelectzpe: -1306.561986 hartree
zpe.sumelectthermal: -1306.537090 hartree
zpe.sumelectthermalent: -1306.536146 hartree
zpe.sumelectthermalfe: -1306.620173 hartree
dipole: -0.2545 3.3918 -0.1659
dipole: 3.4054
quadrupole: -149.3598 -177.3431 -165.8312
quadrupole: -5.7517 -3.1504 -2.9836
quadrupole: 14.8182 -13.1651 -1.6532 -5.7517 -3.1504 -2.9836
hfenergy: -1306.971973 hartree
pointgroup: C01 [X(C18H23N7O3)]
dipole: 0.2465644 -1.3168976 0.0022007 debye
polarizability: 429.0131915|6.6485212|304.0915676|18.1261453|7.41523|140.4448697 unknown
InChI: InChI=1S/C18H23N7O3/c26-15(14-4-2-1-3-5-14)22-23-16-19-17(24-6-10-27-11-7-24)21-18(20-16)25-8-12-28-13-9-25/h1-5,22-23H,6-13H2
charge 0 multiplicity 1
51 atoms
O  -0.583528 -5.266865 0.824329
O  -6.42463 1.917135 0.399366
O  2.819676 3.439449 0.084199
N  -0.872978 -2.622667 -0.252561
N  -3.867695 1.000651 -0.520364
N  -2.398032 -0.837438 -0.394254
N  -1.568701 1.457582 -0.322127
N  -0.005222 -0.427737 -0.188036
N  0.732615 1.779419 -0.14585
N  2.034705 1.283556 -0.068252
C  -1.961477 -3.606636 -0.412704
C  0.471028 -3.211744 -0.104534
C  -4.182769 2.442931 -0.547271
C  -5.040599 0.111425 -0.612003
C  -1.910355 -4.628081 0.739582
C  0.455595 -4.245415 1.040956
C  -5.222597 2.759934 0.545461
C  -6.059033 0.491713 0.482142
C  -1.0995 -1.263157 -0.279347
C  -2.579742 0.527003 -0.409222
C  -0.324323 0.908961 -0.22028
C  3.07421 2.186068 0.034729
C  4.458186 1.617081 0.090897
C  5.499635 2.491731 0.493929
C  4.772417 0.275548 -0.255432
C  6.829996 2.030455 0.567833
C  6.104764 -0.183785 -0.18203
C  7.136779 0.690236 0.23397
H  -1.831432 -4.137112 -1.378276
H  -2.918149 -3.062038 -0.428394
H  1.188211 -2.401971 0.099668
H  0.757926 -3.715517 -1.050415
H  -4.602466 2.702936 -1.540249
H  -3.248817 3.005238 -0.392875
H  -4.697356 -0.928637 -0.499068
H  -5.51094 0.231279 -1.609242
H  -2.621481 -5.452903 0.569259
H  -2.146382 -4.124788 1.702094
H  0.279585 -3.729027 2.009536
H  1.407417 -4.799881 1.085346
H  -5.581826 3.798473 0.460092
H  -4.773474 2.602435 1.549915
H  -5.632538 0.27057 1.484733
H  -7.00409 -0.060949 0.352243
H  0.650176 2.799256 -0.143228
H  2.064461 0.258995 -0.054652
H  5.237041 3.526425 0.736957
H  3.997039 -0.411598 -0.615564
H  7.626792 2.712996 0.882687
H  6.340356 -1.217442 -0.458111
H  8.170526 0.331502 0.288415
