program: Gaussian 09
title: 000256536
version: EM64L-G09RevD.01
frameworkgroup: C1[X(C13H12N4O)]
method: RPBEPBE
basis: SDD
operation: Freq
keyword: #p
keyword: freq=noraman
keyword: PBEPBE/SDD
title: #p freq=noraman PBEPBE/SDD
converged: YES YES NO NO
title: Mulliken charges:
elementType: O N N N N C C C C C C C C C C C C C H H H H H H H H H H H H
charge: -0.204795 -0.162342 -0.354852 -0.025682 -0.007121 -0.416322 -0.549164 0.339550 0.471348 -0.117944 -0.248120 -0.423758 -0.396431 0.029334 -0.241976 -0.239185 -0.220546 -0.237876 0.242297 0.234202 0.237750 0.229154 0.267013 0.341758 0.247440 0.249853 0.236200 0.237386 0.240366 0.242464
chargesum: 0.00000
title: Mulliken charges with hydrogens summed into heavy atoms:
elementType: O N N N N C C C C C C C C C C C C C
charge: -0.204795 -0.162342 -0.013095 -0.025682 -0.007121 0.060177 -0.082260 0.339550 0.471348 -0.117944 0.018893 -0.176318 -0.146577 0.029334 -0.005776 -0.001799 0.019820 0.004588
polarizability: 1.71695342e+02 1.58272282e+00 1.84917923e+02 2.84442672e+01 1.25913266e+00 1.18924057e+02
1716.lowfreq: -10.4081 -5.6521 -0.0009 -0.0006 -0.0005 4.7816 25.7140 47.3230 57.7757
frequency: 25.6411 47.3117 57.7538 69.7455 111.5885 117.8028 187.9462 213.8811 251.7638 292.7423 332.4350 353.6890 401.4123 414.7506 476.5335 488.5965 499.9847 503.9304 563.0071 583.9458 614.9752 616.3584 637.1193 661.4153 674.9473 677.6982 708.4089 756.3911 759.3973 765.0659 789.2898 860.0986 863.3915 891.2214 902.4366 928.6113 940.8487 948.8337 981.8191 990.3364 1001.5736 1003.8897 1026.6533 1034.0851 1079.7539 1096.2572 1129.8923 1173.5738 1176.5225 1190.7152 1207.1638 1217.0979 1259.9209 1293.4320 1321.2085 1330.0622 1342.3292 1344.4728 1355.0541 1362.9260 1379.5734 1422.4115 1440.4022 1464.8158 1469.0816 1484.8108 1509.6571 1532.2643 1589.5914 1596.0027 1609.9645 1633.3267 2991.8732 2999.4183 3058.2868 3069.8476 3113.0037 3121.9233 3131.0179 3140.8571 3153.1103 3170.8243 3227.8643 3467.8795
redmass: 5.9078 5.1615 4.6577 5.9326 5.2868 6.6210 6.1596 3.7506 3.6682 4.4993 6.0739 2.3173 2.8426 3.6427 6.1247 4.5249 3.9207 4.6033 3.1447 5.7153 1.3372 6.1524 2.6005 11.9353 6.3817 4.4191 1.9982 2.9738 1.9480 1.7863 3.8607 2.5866 1.7819 1.4651 1.7527 3.9757 2.1212 2.5791 1.4980 4.5834 2.3990 1.3477 2.2036 3.9943 1.8890 2.5445 1.8537 1.5565 1.1878 1.1204 1.5709 1.9734 2.1951 1.9284 1.6687 2.0969 1.4092 2.5513 1.3591 1.6578 7.2797 3.3331 2.0854 1.1376 1.1572 2.2338 3.7471 6.4659 5.9546 6.3014 6.0585 12.4447 1.0620 1.0634 1.0994 1.1023 1.0886 1.0923 1.0875 1.0908 1.0954 1.1013 1.0982 1.0806
irintensity: 4.2639 0.1638 3.2990 0.3267 2.0973 0.9450 1.7914 2.1376 2.1852 1.8997 1.2580 1.0686 0.0754 0.3820 2.4934 2.9387 3.4963 6.9384 11.7646 0.9883 123.5731 0.8580 2.4049 2.7595 4.9060 12.4488 60.9714 13.4429 36.6753 30.9289 0.9090 3.2155 0.7316 8.4943 8.7639 34.8085 25.8621 2.9488 0.3391 0.1107 13.4225 1.7511 4.1775 2.6960 10.2711 30.8925 33.2378 12.7271 6.1925 1.1584 6.5793 9.0323 2.1077 6.8307 19.1862 32.6838 4.5300 23.8630 1.1481 24.2419 0.8904 5.0575 10.8175 22.1255 16.4181 15.8878 10.5141 289.5663 2.9766 48.6914 6.2974 408.1548 17.0513 33.9578 15.0201 20.4884 8.0929 17.4174 3.6804 5.4281 22.8718 12.3242 0.1103 190.6293
temp: 298.150 k
press: 1.00000 atm
elementType: 8 7 7 7 7 6 6 6 6 6 6 6 6 6 6 6 6 6 1 1 1 1 1 1 1 1 1 1 1 1
symmnumber: 1
zpe: 608226.4 jmol-1
zpe.correction: 0.231661 hartree
zpe.thermalcorrener: 0.246065 hartree
zpe.thermalcorrenthalpy: 0.247009 hartree
zpe.thermalcorrgfe: 0.188781 hartree
zpe.sumelectzpe: -795.536466 hartree
zpe.sumelectthermal: -795.522062 hartree
zpe.sumelectthermalent: -795.521118 hartree
zpe.sumelectthermalfe: -795.579346 hartree
dipole: -11.8510 4.2122 -2.9133
dipole: 12.9103
quadrupole: -142.7628 -95.7744 -98.8689
quadrupole: 13.1177 -2.6747 -0.9731
quadrupole: -30.2941 16.6943 13.5998 13.1177 -2.6747 -0.9731
hfenergy: -795.7681268 hartree
pointgroup: C01 [X(C13H12N4O1)]
dipole: -4.7407146 1.493711 -1.0458121 debye
polarizability: 172.5251271|0.7160038|184.9379511|27.4954579|3.2920775|118.074244 unknown
InChI: InChI=1S/C13H12N4O/c18-13-11-12(14-8-15-13)17(9-16-11)7-6-10-4-2-1-3-5-10/h1-5,8-9,14H,6-7H2
charge 0 multiplicity 1
30 atoms
O  4.210229 -1.148744 0.452416
N  0.591904 1.732131 -0.3490
N  0.342879 -0.679824 -1.021415
N  2.722207 1.589268 0.497639
N  2.290368 -2.051467 -0.585678
C  -0.668861 2.358108 -0.787767
C  -1.859805 2.152461 0.191988
C  1.002247 0.40895 -0.477486
C  -2.315468 0.703616 0.280756
C  2.315806 0.322099 0.033501
C  1.686165 2.399299 0.257224
C  -2.990418 0.09588 -0.813818
C  -2.036065 -0.082292 1.426849
C  3.048591 -0.954512 0.01395
C  1.065573 -1.88541 -1.02966
C  -3.364876 -1.267478 -0.765855
C  -2.409776 -1.445043 1.478657
C  -3.069967 -2.043727 0.381026
H  -0.9313 1.970001 -1.790429
H  -0.468745 3.43831 -0.901923
H  -1.567899 2.530062 1.188345
H  -2.687313 2.793447 -0.170698
H  1.646696 3.463806 0.479873
H  -0.656572 -0.665246 -1.250806
H  -3.245891 0.69628 -1.696656
H  -1.515684 0.371048 2.278595
H  0.518287 -2.737674 -1.451707
H  -3.895236 -1.718376 -1.611918
H  -2.181049 -2.038086 2.37046
H  -3.359328 -3.099185 0.420933
