program: Gaussian 09
title: 000264586
version: EM64L-G09RevD.01
frameworkgroup: C1[X(C6H7N5O5)]
method: RPBEPBE
basis: SDD
operation: Freq
keyword: #pfreq=noraman
keyword: PBEPBE/SDD
title: #p freq=noraman PBEPBE/SDD
converged: YES YES NO NO
title: Mulliken charges:
elementType: O O O O O N N N N N C C C C C C H H H H H H H
charge: -0.200640 -0.196357 -0.182911 -0.138450 -0.258823 -0.211461 0.143496 -0.136462 -0.298684 -0.254440 -0.356483 0.300043 0.233195 0.076171 -0.593215 -0.015775 0.329166 0.385576 0.261104 0.273528 0.252724 0.388947 0.199753
chargesum: 0.00000
title: Mulliken charges with hydrogens summed into heavy atoms:
elementType: O O O O O N N N N N C C C C C C
charge: -0.200640 -0.196357 -0.182911 -0.138450 -0.258823 -0.211461 0.143496 -0.136462 0.086891 0.134507 -0.027317 0.300043 0.233195 0.076171 0.194141 0.183978
polarizability: 1.95980162e+02 9.68325506e+00 1.30772058e+02 -6.91403535e+00 -1.27230082e+01 7.19210761e+01
1716.lowfreq: -7.0814 -3.6102 -2.4901 -0.0006 -0.0005 0.0002 28.4088 57.4044 58.7909
frequency: 28.4034 57.4041 58.7894 81.9011 90.0870 106.2677 121.9706 157.3464 184.8949 199.2546 225.7732 274.3600 322.2901 333.4087 353.7820 389.5820 408.1515 469.1131 498.8298 532.7525 568.9905 607.3604 635.8845 651.0757 668.3585 720.1125 726.4105 739.6230 774.1453 823.1821 837.0836 934.1085 944.4684 980.7550 1020.6265 1095.9086 1128.3756 1143.4435 1167.1798 1192.7684 1230.3738 1243.8088 1248.3270 1292.0221 1334.7232 1349.8400 1417.9392 1429.8852 1442.4036 1473.1975 1477.3956 1524.7952 1574.5521 1598.4548 1621.4863 1643.3480 3016.6087 3023.1804 3074.3625 3108.7904 3152.0884 3441.0113 3469.8419
redmass: 10.8523 12.8683 7.8000 6.7627 4.9582 1.1375 5.1086 9.2283 6.1130 10.4739 7.0250 5.1798 3.6344 9.7309 6.6805 7.9667 4.1055 10.3761 9.6782 9.3687 7.7677 6.1177 4.0462 1.3106 1.1832 9.2714 7.2093 7.0567 7.6159 8.3098 6.7140 1.5511 2.8638 4.6574 2.7722 4.5800 1.3214 3.7749 2.1735 2.1958 2.3138 2.3888 2.0083 1.7655 4.9929 1.2922 2.3801 1.3848 7.9627 1.0590 1.0479 2.8267 4.7346 10.6813 7.9430 10.2042 1.0337 1.0903 1.0850 1.1021 1.1019 1.0815 1.0803
irintensity: 0.6435 0.5348 1.6346 5.4200 13.2518 0.7598 9.8932 7.1436 5.5977 5.3152 11.2496 2.6643 17.0742 14.1606 1.2904 21.1137 22.2894 3.3880 6.9686 3.1798 6.7496 24.6905 8.0189 114.8496 83.3463 6.7774 57.0577 14.6887 12.4010 28.9612 7.6382 2.5846 2.3864 186.5925 35.0360 72.1879 1.0857 114.2133 131.2743 8.9459 15.9925 126.3477 97.7712 179.4808 26.2115 55.9577 293.6706 15.5127 55.0046 17.0353 18.7641 406.3630 711.6300 618.0008 6.5332 10.6790 20.3240 50.0707 1.3443 12.1309 0.8503 23.5570 240.5377
temp: 298.150 k
press: 1.00000 atm
elementType: 8 8 8 8 8 7 7 7 7 7 6 6 6 6 6 6 1 1 1 1 1 1 1
symmnumber: 1
zpe: 403396.7 jmol-1
zpe.correction: 0.153646 hartree
zpe.thermalcorrener: 0.168771 hartree
zpe.thermalcorrenthalpy: 0.169715 hartree
zpe.thermalcorrgfe: 0.109732 hartree
zpe.sumelectzpe: -881.430266 hartree
zpe.sumelectthermal: -881.415141 hartree
zpe.sumelectthermalent: -881.414196 hartree
zpe.sumelectthermalfe: -881.474179 hartree
dipole: 0.7621 -2.3536 -1.5721
dipole: 2.9312
quadrupole: -98.3214 -105.4451 -93.3574
quadrupole: -8.4615 2.9324 0.6545
quadrupole: 0.7199 -6.4038 5.6839 -8.4615 2.9324 0.6545
hfenergy: -881.5839119 hartree
pointgroup: C01 [X(C6H7N5O5)]
dipole: 0.2954364 0.8447072 0.7273823 debye
dipolederiv: -0.6738257 -0.317922 0.1912979 -0.2058529 -0.8052092 0.1973934 0.1487657 0.2137242 -0.3848253 -0.8109578 0.215426 -0.0472874 0.3012032 -1.0286512 0.2115555 -0.093344 0.2054805 -0.4057211 -0.5794985 0.3004142 -0.1033764 0.240816 -0.5113163 -0.0829999 -0.0582175 -0.1842681 -0.3931831 -0.4621295 0.0683166 -0.1584781 0.0400647 -0.2908196 -0.1358574 -0.3170077 -0.2902411 -0.5288807 -0.9259601 0.0382376 -0.0578882 0.8472158 -0.6739471 0.1423364 -0.2215528 0.0764511 -0.389413 -0.9038129 -0.0632536 0.0991009 -0.5300288 -1.2514232 0.3231732 0.1775156 0.3187187 -0.2557535 0.7844394 -0.4740653 0.2679988 -0.3991521 0.7769393 0.4268618 0.3242303 0.7705939 0.9456463 -1.6764904 0.160267 -0.1088431 1.0255427 -0.7884914 0.0790176 -0.3457492 0.1676675 -0.2844952 -0.9472575 0.2776423 -0.137595 0.700087 -0.2240972 0.0698691 -0.3034677 0.0528508 -0.2645954 -1.4818829 0.1440293 -0.1569654 -0.0453303 -0.2169147 -0.054687 -0.0379795 -0.0074089 -0.2730605 -0.031784 0.0251362 -0.0124012 0.0655457 -0.2053426 -0.2135282 0.0087569 -0.2237611 0.0291652 1.3153623 -0.1613732 0.2949984 -1.0072834 0.7992523 -0.0802188 0.4563356 -0.2024188 0.1079479 0.7208348 0.0111194 -0.2522968 0.2484037 1.3508271 -0.4050461 -0.2368528 -0.4220078 0.2945679 2.3881521 -0.0348605 -0.0262569 0.0574498 1.5737806 -0.3842297 0.0355362 -0.4331862 0.3922886 0.3762948 -0.0495921 -0.0096493 -0.1438758 0.0905557 0.0316592 0.0303056 0.0498346 0.1822988 2.0529282 -0.218938 0.201232 -0.8745095 0.8131932 -0.2142738 0.2708888 -0.1522086 0.2198309 0.0257649 0.0421452 -0.0120162 -0.0008452 0.0412842 0.025304 -0.0169925 -0.0025956 0.0855271 0.3517336 0.0252792 0.0260103 -0.1401446 0.2745774 0.0157268 0.1268663 -0.0027663 0.3478794 0.0086453 0.0090556 -0.0230889 -0.0781161 0.0301097 -0.0994149 -0.0411485 -0.0595358 0.033325 0.1828817 -0.037853 0.0163631 0.0899619 0.0172076 0.0393485 -0.0285827 0.0452809 0.116778 0.0022774 0.0257673 0.0200418 -0.0156825 0.1082414 0.0335767 0.0841538 -0.0108291 -0.0686012 0.2645965 0.0627507 -0.0122683 -0.033629 0.2493369 0.0252849 0.0086403 0.0356574 0.3580337 0.0196883 -0.047729 0.0013678 -0.14184 -0.129093 0.0491486 0.0288997 0.0549678 0.1352403 unknown
polarizability: 194.6558821|-11.9371114|133.477151|10.7101973|-6.7708089|70.5402622 unknown
InChI: InChI=1S/C6H7N5O5/c1-10-5(13)3(11(15)16)4(8-6(10)14)9-7-2-12/h2-3,7,9H,1H3
charge 0 multiplicity 1
23 atoms
O  -2.70432 -1.458793 0.920013
O  -1.652434 2.876519 -0.506488
O  0.986742 -2.614461 -0.647362
O  -0.99689 -2.065332 -1.643892
O  4.579415 -0.251311 0.616309
N  -2.202111 0.69858 0.174401
N  -0.128666 -1.977676 -0.718429
N  0.120121 1.447615 -0.013886
N  1.873534 0.021182 0.429765
N  2.735623 1.101483 0.238526
C  -0.375533 -0.973879 0.471194
C  0.53539 0.220786 0.284425
C  -1.861448 -0.600205 0.546329
C  -1.243231 1.746397 -0.148973
C  -3.647687 1.032118 0.151025
C  4.097413 0.885017 0.34946
H  -0.111839 -1.56792 1.361666
H  2.335545 -0.890294 0.55072
H  -4.178294 0.324299 -0.505681
H  -3.748269 2.059381 -0.224783
H  -4.070804 0.952076 1.166133
H  2.243448 1.97765 0.01224
H  4.686598 1.806569 0.178187
