program: Gaussian 09
title: 000264621
version: EM64L-G09RevD.01
frameworkgroup: C1[X(C12H26NO4P)]
method: RPBEPBE
basis: SDD
operation: Freq
keyword: #p
keyword: freq=noraman
keyword: PBEPBE/SDD
title: #p freq=noraman PBEPBE/SDD
converged: YES YES NO NO
title: Mulliken charges:
elementType: P O O O O N C C C C C C C C C C C C H H H H H H H H H H H H H H H H H H H H H H H H H H
charge: 1.279908 -0.495613 -0.511289 -0.195813 -0.629722 -0.366735 -0.340252 -0.363925 -0.308692 -0.255284 -0.345835 -0.339803 -0.685726 -0.688472 0.003114 -0.064578 -0.657994 -0.670257 0.231344 0.196692 0.190113 0.208256 0.231063 0.222902 0.226444 0.232357 0.201915 0.191588 0.185601 0.234990 0.216840 0.216334 0.209440 0.203119 0.216647 0.211107 0.203142 0.241585 0.236109 0.218149 0.231262 0.232409 0.208509 0.239051
chargesum: 0.00000
title: Mulliken charges with hydrogens summed into heavy atoms:
elementType: P O O O O N C C C C C C C C C C C C
charge: 1.279908 -0.495613 -0.511289 -0.195813 -0.629722 -0.366735 0.087784 0.034444 0.145273 0.203518 0.047668 0.080787 -0.043112 -0.057599 0.206256 0.177006 0.027527 0.009713
polarizability: 2.36912728e+02 -2.31245954e+00 1.74526059e+02 3.25174399e+00 -3.13737133e+00 1.45542215e+02
1716.lowfreq: -18.6780 -4.5491 -1.7291 -0.0006 0.0008 0.0011 8.9045 13.2054 19.0097
frequency: -15.2258 12.9324 18.1570 20.1186 37.8546 47.5591 51.0847 65.8744 79.8239 87.3826 101.7203 105.2991 130.5175 170.5043 181.8866 187.8962 190.4119 204.7322 210.9717 224.7626 241.5511 245.1499 247.8041 267.4088 281.5260 311.8497 337.8637 373.2772 388.5330 403.7819 420.4929 434.6958 484.7729 501.9995 518.9705 623.6177 695.0530 716.4740 742.4231 751.6534 802.2897 826.3648 843.4380 852.0342 898.6444 903.0988 913.3415 924.5870 931.4993 939.1803 940.7701 955.0175 982.5623 1025.2710 1032.8732 1034.6561 1069.1938 1074.9297 1096.2751 1115.3625 1125.1368 1135.0653 1150.2307 1156.8198 1167.0067 1189.0407 1211.6577 1223.2399 1238.3547 1272.8672 1287.5049 1289.5155 1290.7732 1307.4609 1313.5333 1329.0928 1350.4379 1355.6599 1364.1190 1369.3819 1371.8125 1386.0745 1390.5582 1391.8314 1401.4323 1448.1543 1454.9016 1457.3699 1465.1101 1468.3416 1469.2732 1475.8140 1476.5463 1478.4029 1479.1009 1480.9996 1486.1264 1486.7467 1488.0900 1609.1672 2968.9523 2969.1351 2969.2748 2971.2671 2976.0172 2977.5065 2981.7491 2984.7566 2989.5739 2994.2113 2998.5782 3001.4501 3013.0107 3025.5918 3044.7270 3045.0096 3064.3901 3071.7310 3072.7565 3073.4297 3075.2145 3085.9148 3086.8567 3095.3857 3101.0207 3108.1916
redmass: 2.6092 3.0188 3.6872 4.0674 2.5173 3.2154 2.7085 3.0821 2.2360 4.6951 2.3738 3.1084 4.3843 4.0396 3.0976 1.1144 2.3733 2.8267 2.8172 1.3269 1.1849 1.6032 1.4514 2.8830 5.3677 4.6225 3.9059 5.3775 3.6882 3.9773 3.7580 4.1787 3.1875 5.3142 3.5224 5.6800 3.6076 6.3249 1.0741 1.3489 1.1582 1.8708 3.2985 2.2976 1.8776 2.8284 2.5461 1.1846 2.9703 1.5159 1.4068 1.2565 1.5172 3.7405 4.5610 5.9729 2.1179 2.4436 1.7854 2.4354 1.9551 1.7677 2.1688 1.6273 3.5392 2.3884 1.2648 1.3134 1.2953 1.2579 1.1209 1.1481 1.0842 1.2729 1.1784 1.5033 1.4482 1.2604 1.6403 1.2949 1.2310 1.2577 1.2168 1.2125 1.2166 1.0831 1.0474 1.0805 1.0485 1.0746 1.0492 1.0479 1.0655 1.0420 1.0454 1.0854 1.0522 1.0821 1.0800 7.0945 1.0572 1.0804 1.0586 1.0468 1.0368 1.0659 1.0831 1.0594 1.0378 1.0576 1.0365 1.0605 1.1001 1.0942 1.1020 1.1005 1.1074 1.0989 1.1018 1.1005 1.1001 1.0997 1.1062 1.1005 1.0996 1.1007
irintensity: 0.2407 0.3419 0.1350 3.0242 1.1365 0.1544 3.8982 0.7792 0.9628 0.7608 0.2462 0.7050 2.2933 0.6759 7.2058 1.1608 4.9256 15.5402 20.0392 2.5234 1.1447 1.7939 0.2434 3.0211 9.5640 2.5824 13.4706 22.3542 6.1539 15.4142 17.2323 11.7574 4.8819 30.0809 32.8706 43.0451 129.2500 369.5580 8.7503 41.6442 0.9745 2.0185 25.4455 80.4762 42.7975 25.4476 153.6283 3.6600 160.8181 57.3356 0.1797 8.0894 6.9459 91.1730 40.5443 80.9941 25.1023 10.4474 140.5276 5.6659 4.3886 2.6886 27.8163 2.4492 121.5401 145.2329 0.2961 0.0216 1.7779 2.7474 2.2462 0.3361 0.6386 1.7217 58.1545 12.2757 1.0717 9.5419 0.5508 26.3434 35.9848 32.8517 10.1753 9.7363 27.6583 7.5439 5.0261 2.8854 1.3072 0.7166 13.7127 4.8334 3.6786 12.2798 14.8376 9.3923 13.4562 12.5718 17.6519 812.2316 14.5341 16.4692 29.3320 44.8470 31.0500 35.2337 32.8912 18.6554 13.0382 33.4520 16.9514 60.8231 5.6805 12.3878 7.1517 7.0201 20.4725 49.6869 109.4998 47.4131 44.3565 28.2854 49.8046 7.2699 41.3710 29.0051
temp: 298.150 k
press: 1.00000 atm
elementType: 15 8 8 8 8 7 6 6 6 6 6 6 6 6 6 6 6 6 1 1 1 1 1 1 1 1 1 1 1 1 1 1 1 1 1 1 1 1 1 1 1 1 1 1
symmnumber: 1
zpe: 976860.0 jmol-1
zpe.correction: 0.372066 hartree
zpe.thermalcorrener: 0.395833 hartree
zpe.thermalcorrenthalpy: 0.396777 hartree
zpe.thermalcorrgfe: 0.314480 hartree
zpe.sumelectzpe: -1168.225437 hartree
zpe.sumelectthermal: -1168.201671 hartree
zpe.sumelectthermalent: -1168.200727 hartree
zpe.sumelectthermalfe: -1168.283023 hartree
dipole: 2.8719 -0.4709 -0.5712
dipole: 2.9658
quadrupole: -85.8500 -112.7093 -127.4097
quadrupole: -2.2289 10.1973 -0.8136
quadrupole: 22.8064 -4.0530 -18.7534 -2.2289 10.1973 -0.8136
hfenergy: -1168.5975037 hartree
pointgroup: C01 [X(C12H26N1O4P1)]
dipole: 0.8419323 0.7945216 0.1463225 debye
polarizability: 216.2348805|29.3459244|193.6175025|-3.3157513|-9.6074132|147.1286191 unknown
InChI: InChI=1S/C12H26NO4P/c1-5-7-9-16-18(14,17-10-8-6-2)13-11-15-12(3)4/h11-12H,5-10H2,1-4H3
charge 0 multiplicity 1
44 atoms
P  -0.260857 0.579756 -0.054506
O  -1.459312 1.092595 1.091204
O  -0.067372 -1.111857 0.196772
O  3.015194 2.667292 0.567403
O  -0.584124 0.928572 -1.576675
N  1.180566 1.268815 0.699979
C  -3.55849 -0.139636 0.44586
C  0.287982 -3.141097 1.473709
C  -2.85738 1.219035 0.581463
C  0.278782 -1.614983 1.565617
C  -5.029545 0.024782 -0.004702
C  1.365787 -3.696433 0.516054
C  -5.754158 -1.330797 -0.152905
C  1.355437 -5.238039 0.446824
C  3.83636 3.568403 -0.327872
C  1.888706 2.11575 0.010965
C  4.77788 2.699083 -1.172247
C  4.555476 4.527328 0.621803
H  -3.015508 -0.7634 -0.291015
H  -3.519322 -0.670496 1.417199
H  0.45549 -3.537729 2.497312
H  -0.713963 -3.487932 1.153656
H  -2.841096 1.751944 -0.389142
H  -3.343741 1.852104 1.343292
H  -0.481865 -1.247993 2.280655
H  1.267897 -1.208339 1.847344
H  -5.057968 0.564954 -0.972632
H  -5.573678 0.657647 0.725903
H  2.363699 -3.343981 0.84879
H  1.198853 -3.268724 -0.489666
H  -5.248248 -1.968575 -0.901452
H  -6.801948 -1.193638 -0.477285
H  -5.765673 -1.882146 0.806024
H  1.544436 -5.68565 1.441501
H  2.130661 -5.614745 -0.245387
H  0.37658 -5.61194 0.09129
H  3.131194 4.125094 -0.979775
H  1.651582 2.45343 -1.019746
H  5.429073 2.094675 -0.517311
H  5.417453 3.338973 -1.806996
H  4.215838 2.014333 -1.832109
H  5.214789 3.965931 1.30606
H  5.172541 5.238713 0.044367
H  3.831095 5.097718 1.226776
