program: Gaussian 09
title: 000256524
version: EM64L-G09RevD.01
frameworkgroup: C1[X(C9H12N2O3)]
method: RPBEPBE
basis: SDD
operation: Freq
keyword: #p
keyword: freq=noraman
keyword: PBEPBE/SDD
title: #p freq=noraman PBEPBE/SDD
converged: YES YES NO NO
title: Mulliken charges:
elementType: O O O N N C C C C C C C C C H H H H H H H H H H H H
charge: -0.333402 -0.430242 -0.378123 -0.595805 -0.317579 -0.612466 -0.166528 0.491545 -0.375408 -0.390217 0.271275 -0.345309 -0.390555 0.278068 0.213921 0.236696 0.233152 0.243738 0.235814 0.266931 0.312085 0.254736 0.221217 0.342343 0.354224 0.379889
chargesum: 0.00000
title: Mulliken charges with hydrogens summed into heavy atoms:
elementType: O O O N N C C C C C C C C C
charge: -0.333402 -0.076017 0.001765 -0.016789 0.024764 -0.161849 0.066624 0.491545 -0.131670 -0.154403 0.271275 -0.090573 -0.169338 0.278068
polarizability: 1.55902860e+02 -1.90698917e+01 1.15019623e+02 1.94702084e+01 1.33260019e+01 9.36914576e+01
1716.lowfreq: -9.7846 -5.9253 -0.0007 -0.0006 -0.0005 8.0817 20.5443 32.9374 44.2335
frequency: 20.1902 32.8892 44.2202 80.0219 117.6619 178.8059 205.2948 255.7127 276.0940 305.8530 308.3033 323.4732 351.0122 367.4574 404.1089 409.9248 430.8893 443.6279 483.7312 507.7766 542.2687 565.7332 635.9562 662.0810 694.3152 716.6754 763.6162 805.3985 827.3575 838.1659 887.7643 927.5781 948.1646 965.7646 969.3320 992.2979 1003.7208 1094.3216 1118.2832 1139.8161 1146.2009 1169.8981 1178.9264 1213.5065 1221.3246 1248.6016 1281.2343 1304.9953 1321.6391 1332.0630 1387.7410 1398.4692 1425.3670 1463.0551 1502.6007 1504.4312 1556.1835 1594.5977 1624.7091 1630.1852 2960.7993 2985.7101 3056.7466 3106.5009 3129.3218 3133.4903 3172.0856 3257.9571 3470.3757 3582.6987 3601.3613 3610.8821
redmass: 4.3067 6.4398 6.5965 5.0500 5.2112 6.2610 4.1699 3.0058 2.3457 2.3615 2.4958 3.4037 1.1077 3.2358 3.1035 2.9456 1.8604 2.5828 1.1238 2.9773 3.6135 1.3831 6.4768 3.0685 4.3329 3.7586 4.3252 1.4911 2.3198 2.2139 3.0513 1.4837 2.5572 1.5762 2.5032 5.5425 2.7985 1.4423 1.5795 1.3728 1.3089 1.5713 1.1169 2.1061 1.7160 2.9262 1.3629 1.2415 1.2247 1.5721 4.4674 2.1581 2.8131 1.1081 2.7278 1.9743 2.9751 6.3628 5.7905 1.2498 1.0843 1.0620 1.1018 1.0870 1.0952 1.0914 1.0954 1.0635 1.0452 1.0660 1.0830 1.0987
irintensity: 0.3602 3.9717 2.0954 2.3211 1.3206 0.1416 2.5400 26.9854 42.2630 28.5996 2.4743 12.4807 137.9483 29.8537 10.5658 5.2992 80.8772 59.8195 132.1298 10.0000 10.1696 413.6633 0.4687 5.9689 3.6153 1.3574 13.8798 33.2387 6.8694 18.4211 16.0534 1.9297 31.2043 3.9420 20.6397 65.4720 5.1669 40.3931 5.5966 182.7943 48.0146 20.0175 1.3585 3.3246 4.2325 35.6247 1.5191 3.5000 4.7715 116.9317 36.3796 27.0522 10.0413 10.2432 115.7084 43.2279 191.7224 6.8193 26.7478 27.2518 35.4924 41.7078 14.5602 17.4896 23.3761 3.5717 4.3504 27.9743 18.7108 41.8851 49.8683 12.4519
temp: 298.150 k
press: 1.00000 atm
elementType: 8 8 8 7 7 6 6 6 6 6 6 6 6 6 1 1 1 1 1 1 1 1 1 1 1 1
symmnumber: 1
zpe: 533650.0 jmol-1
zpe.correction: 0.203257 hartree
zpe.thermalcorrener: 0.217530 hartree
zpe.thermalcorrenthalpy: 0.218474 hartree
zpe.thermalcorrgfe: 0.160694 hartree
zpe.sumelectzpe: -684.226765 hartree
zpe.sumelectthermal: -684.212492 hartree
zpe.sumelectthermalent: -684.211548 hartree
zpe.sumelectthermalfe: -684.269328 hartree
dipole: -2.7198 -3.2823 -1.5173
dipole: 4.5247
quadrupole: -87.2625 -81.9585 -79.6869
quadrupole: -1.5220 10.7297 2.9980
quadrupole: -4.2932 1.0108 3.2824 -1.5220 10.7297 2.9980
hfenergy: -684.4300218 hartree
pointgroup: C01[X(C9H12N2O3)]
dipole: 1.1851533 1.1801662 -0.6095615 debye
dipolederiv: -0.756143 0.1113866 0.2870666 -0.2339902 -0.5710609 0.0973641 0.3292955 -0.1228704 -0.6223596 -1.3100454 0.4444582 0.1117503 0.5317717 -0.4990711 -0.25987 0.1415418 -0.2582096 -0.2467222 -0.257848 -0.0836201 -0.0978442 -0.0542678 -0.6361963 -0.146971 -0.081646 0.1006566 -0.2152175 -0.9552324 0.1707195 -0.2067987 0.2742223 -0.4157611 -0.0379736 -0.3646798 0.0780633 -0.5967583 -0.3520805 0.195479 0.0960315 0.1585284 0.0550788 -0.1374623 0.0681463 -0.3781295 -0.5353491 -0.1612626 0.1579914 -0.0574152 -0.0726598 0.0519867 -0.0185682 -0.1869758 0.1009689 0.0687004 0.6754519 -0.2927133 0.0975019 -0.2622964 0.144507 0.0289454 0.1799684 0.0028469 0.3318867 0.1399556 -0.0829806 -0.0036025 -0.2020216 -0.0801025 0.0277602 -0.1074774 0.0696216 -0.1776791 0.0107592 -0.0790954 -0.0375292 0.0072836 0.0213852 -0.1325011 -0.0823157 -0.0802579 0.0159937 0.0127595 -0.0008544 -0.1498008 -0.0971131 -0.0035888 -0.0675947 -0.0180001 -0.1465686 0.0133718 0.7297668 -0.1942333 -0.5036592 0.1584144 0.6218303 0.2010345 -0.5772901 0.279746 0.6546334 -0.2798218 0.0821153 -0.0180673 -0.0871973 -0.0244495 -0.0627366 0.174348 -0.1908074 -0.0718498 -0.2530144 0.0183653 0.003411 0.267187 -0.2054764 -0.1570246 -0.2200196 -0.0037326 -0.0483134 1.1598949 -0.5166834 -0.2311277 -0.5966476 0.3311941 0.1382403 -0.2263436 0.1272704 0.1101614 -0.012572 -0.0310778 0.0030741 0.0390426 -0.1812461 -0.0116234 -0.0028604 0.0225731 0.0678602 0.0117243 0.0300539 0.0561393 -0.0041268 0.0728298 0.0620794 0.0588134 -0.006076 -0.0831662 -0.0514942 0.0280276 0.0944573 -0.0098576 0.0133311 -0.0188268 0.1073338 -0.0248202 -0.1182974 0.0308689 -0.0192426 0.113098 -0.0122185 0.0882884 0.0435347 0.1006501 0.0533697 0.0193038 0.0829916 0.0813717 -0.0204657 0.0676875 -0.0178907 0.1009986 -0.0249122 0.0952022 0.0503574 0.2340732 -0.0950539 0.0546497 -0.0546897 0.0368107 -0.0238833 0.1489616 -0.1359048 0.3176743 0.2863723 0.0140858 0.048824 0.0130242 0.2544011 0.064601 0.1587397 0.0060225 0.1799794 0.0902407 0.056726 -0.0076831 0.071248 0.0331705 0.0926122 -0.0084354 0.0887278 0.0790139 -0.0204739 0.0005399 0.1313594 0.014106 0.1045351 0.0585918 0.1373437 0.0630987 0.0138122 0.2744528 0.0157107 0.1028503 0.0422281 0.1435348 0.0402279 0.125128 0.0847005 0.3398974 0.399152 -0.0316451 0.0354265 -0.0664416 0.2602798 0.1671356 0.0570644 0.1452379 0.1849536 0.2715243 0.020169 0.0983536 0.1087841 0.4016803 -0.0480901 0.1136215 0.0292711 0.2681132 unknown
polarizability: 150.9145142|-22.849336|119.4273708|-21.8416919|-10.7321387|94.2720558 unknown
InChI: InChI=1S/C9H12N2O3/c10-8(9(13)11-14)5-6-1-3-7(12)4-2-6/h1-4,8,11-12,14H,5,10H2
charge 0 multiplicity 1
26 atoms
O  -3.249018 -0.629367 0.628526
O  4.14556 -1.182933 -0.371518
O  -1.970495 -2.60092 -0.621262
N  -3.174064 1.983851 -0.338284
N  -1.688044 -1.222219 -0.926643
C  -0.816406 1.605426 0.584234
C  -1.94826 1.193936 -0.443386
C  0.506451 0.899486 0.343901
C  0.915047 -0.204863 1.139597
C  1.354721 1.299903 -0.721243
C  -2.34458 -0.265539 -0.208139
C  2.123617 -0.884547 0.890956
C  2.568293 0.628203 -0.988727
C  2.951709 -0.466529 -0.176511
H  -0.69159 2.701232 0.478656
H  -1.19726 1.412011 1.603916
H  -1.516636 1.293787 -1.461265
H  0.276733 -0.538503 1.96631
H  1.074955 2.160071 -1.342685
H  -3.044121 2.995452 -0.279133
H  -3.848661 1.598379 0.330209
H  2.440094 -1.732105 1.505784
H  3.212996 0.961557 -1.812794
H  -0.852969 -1.116694 -1.501757
H  4.659213 -0.814924 -1.132763
H  -2.721187 -2.49445 0.049723
