program: Gaussian 09
title: 000256516
version: EM64L-G09RevD.01
frameworkgroup: C1[X(C16H24O4)]
method: RPBEPBE
basis: SDD
operation: Freq
keyword: #pfreq=noraman
keyword: PBEPBE/SDD
title: #p freq=noraman PBEPBE/SDD
converged: NO YES NO NO
title: Mulliken charges:
elementType: O O O O C C C C C C C C C C C C C C C C H H H H H H H H H H H H H H H H H H H H H H H H
charge: -0.291212 -0.280618 -0.278749 -0.222766 -0.016382 -0.511453 0.094653 0.080010 0.009252 0.021264 0.238012 0.226284 0.017535 -0.708886 -0.717450 -0.835428 -0.834704 -0.518641 -0.521803 -0.514960 0.216439 0.276756 0.247440 0.250725 0.205156 0.197077 0.212338 0.215777 0.206036 0.216985 0.258474 0.261505 0.259006 0.261796 0.217973 0.236554 0.220479 0.233852 0.260504 0.229953 0.208744 0.235592 0.217400 0.219484
chargesum: 0.00000
title: Mulliken charges with hydrogens summed into heavy atoms:
elementType: O O O O C C C C C C C C C C C C C C C C
charge: -0.291212 -0.280618 -0.278749 -0.222766 0.200057 0.012742 0.094653 0.080010 0.009252 0.021264 0.238012 0.226284 0.017535 -0.055928 -0.083299 -0.098464 -0.095929 0.172244 0.177398 0.157515
polarizability: 2.33892641e+02 -5.70931039e-01 2.04322434e+02 -1.06396380e+01 1.37173132e+00 1.32661580e+02
1716.lowfreq: -7.4475 -4.2483 -0.0007 -0.0005 0.0007 7.7668 22.9994 32.4571 37.7226
frequency: 22.4372 32.2299 37.6418 46.9170 61.1405 90.6533 91.5706 92.7830 101.5552 107.7432 111.3744 134.9090 139.5387 150.7533 158.4825 166.0237 172.0565 188.7070 201.2348 208.3550 226.1315 239.8821 279.2559 285.8093 303.7657 327.9006 331.6795 335.0677 339.3842 382.1659 390.6792 417.6622 449.7716 476.4956 490.2909 532.4265 548.5959 665.7162 676.8647 683.0245 717.6075 792.0406 802.7862 809.6297 837.9383 877.5135 899.1140 916.3913 947.6711 952.2010 957.7214 965.7161 980.2782 1033.0768 1046.6657 1047.3979 1060.6099 1078.5944 1093.7155 1101.0922 1112.0155 1115.4227 1117.4049 1148.2045 1151.5478 1153.8123 1155.3873 1179.8667 1217.3656 1231.9137 1276.5963 1316.8787 1330.0106 1343.5155 1350.5421 1375.9946 1385.2091 1387.3119 1391.2267 1392.7244 1393.6951 1425.3381 1439.1321 1443.8454 1444.8845 1454.7954 1457.7159 1459.1245 1463.3290 1464.9000 1466.7150 1467.9621 1469.5586 1472.4050 1476.0694 1480.7163 1482.2807 1484.6397 1490.7447 1576.0412 1579.9228 1600.4907 2955.8068 2958.7753 2962.6775 2963.3073 2965.4689 2971.7626 2972.4371 2973.4832 2988.6524 3009.2036 3041.3045 3053.8470 3056.9929 3059.9113 3060.2507 3063.7532 3064.3292 3067.9635 3087.9102 3107.1511 3107.9690 3112.6683 3116.8654 3117.9843
redmass: 4.1346 2.6878 3.9289 2.7095 2.9071 2.9485 2.9603 3.0008 3.3758 1.1940 2.3140 1.0574 2.8259 1.0907 1.1607 1.1832 2.8702 2.9530 1.0443 3.3849 3.8871 1.1637 3.9340 3.8498 3.1921 4.1010 4.0912 5.6575 4.0358 2.6096 4.6631 2.0512 5.0191 3.9789 5.1866 4.9977 5.8948 4.4821 5.2469 5.1632 5.6507 4.2242 4.3886 4.0511 3.3362 2.1646 3.9666 1.1970 5.3771 3.7763 1.9375 2.3699 1.9682 1.8169 1.5304 1.5248 2.4963 4.8440 3.1141 1.7464 1.2512 1.2422 1.2571 1.7946 1.4748 1.7435 1.4031 1.7872 1.3690 4.9775 1.6403 2.4584 1.9812 7.8066 1.9714 1.2130 2.4199 1.4099 2.2088 1.3145 1.2529 1.1119 1.1924 1.3914 1.4659 1.0586 1.0595 1.0576 1.0778 1.0617 1.0559 1.0738 1.0494 1.0671 1.0658 1.0539 1.0804 1.0858 1.0496 8.4006 7.2907 8.6528 1.0315 1.0605 1.0311 1.0320 1.0357 1.0384 1.0436 1.0428 1.0828 1.0956 1.1039 1.1044 1.0992 1.0885 1.0881 1.1024 1.0992 1.0988 1.0989 1.1007 1.1006 1.1006 1.1014 1.1025
irintensity: 0.8628 1.7465 0.3135 3.6070 5.2842 0.5735 0.5170 1.3340 3.3856 2.2898 6.3329 0.0369 0.4706 0.0311 0.1465 0.6807 2.3319 2.0309 0.0244 8.5929 8.2880 0.3749 2.8502 12.1008 0.6799 7.6968 7.1343 12.4318 0.5021 3.0912 0.4322 1.1359 7.7141 0.2150 7.8486 3.9494 1.6941 7.4383 11.5156 0.9569 20.0360 0.5444 0.4257 7.8753 2.2732 14.4435 14.8415 3.2293 65.3822 24.0211 19.2279 13.9831 2.8593 6.5280 1.0320 0.9985 50.0909 137.7204 201.3170 11.8300 0.6603 0.0900 5.6647 9.3080 7.9771 49.9524 13.6782 14.8932 11.6716 9.6502 18.4484 7.8274 30.3458 0.0962 96.5831 23.5105 13.5959 34.2219 39.8076 7.0857 10.0004 30.8533 8.5765 1.6803 18.5208 22.5782 19.7814 14.4699 8.9195 7.3174 8.4413 13.9771 6.5190 1.0703 3.2069 6.3176 19.0122 23.7925 21.9121 45.8788 96.6067 97.1641 57.6536 17.1582 45.3131 66.5877 31.6843 34.3483 42.3835 41.1098 7.4925 6.4343 47.3339 40.6523 12.1205 7.5255 20.8496 30.3395 44.6097 84.9719 31.6029 3.9852 6.0311 29.4423 26.6080 22.3078
temp: 298.150 k
press: 1.00000 atm
elementType: 8 8 8 8 6 6 6 6 6 6 6 6 6 6 6 6 6 6 6 6 1 1 1 1 1 1 1 1 1 1 1 1 1 1 1 1 1 1 1 1 1 1 1 1
symmnumber: 1
zpe: 957516.0 jmol-1
zpe.correction: 0.364699 hartree
zpe.thermalcorrener: 0.389415 hartree
zpe.thermalcorrenthalpy: 0.390359 hartree
zpe.thermalcorrgfe: 0.309230 hartree
zpe.sumelectzpe: -923.390151 hartree
zpe.sumelectthermal: -923.365435 hartree
zpe.sumelectthermalent: -923.364490 hartree
zpe.sumelectthermalfe: -923.445619 hartree
dipole: 2.8751 -0.9229 2.1664
dipole: 3.7164
quadrupole: -111.5488 -112.0390 -123.7675
quadrupole: 3.0241 9.8864 -2.4464
quadrupole: 4.2363 3.7461 -7.9825 3.0241 9.8864 -2.4464
hfenergy: -923.7548494 hartree
pointgroup: C01 [X(C16H24O4)]
dipole: 1.152808 0.4214903 -0.794482 debye
polarizability: 233.8827171|-3.5610284|201.9436903|9.8367372|13.1054371|135.0502482 unknown
InChI: InChI=1S/C16H24O4/c1-9(2)8-12(17)13-15(19-6)10(3)14(18-5)11(4)16(13)20-7/h9H,8H2,1-7H3
charge 0 multiplicity 1
44 atoms
O  -0.107805 2.297057 0.18239
O  -0.356697 -2.534104 -0.400689
O  3.903737 -0.44276 0.78888
O  -2.119754 -0.272327 -1.65609
C  -4.110992 0.36956 0.354998
C  -2.596172 0.378094 0.662252
C  -0.207123 -0.111565 -0.187319
C  -1.691233 -0.020544 -0.494988
C  0.556912 1.038093 0.127787
C  0.436438 -1.374326 -0.200241
C  1.941797 0.962425 0.423757
C  1.81761 -1.511962 0.09487
C  2.539226 -0.326794 0.402348
C  -4.646346 -1.075418 0.212596
C  -4.881434 1.142425 1.450894
C  2.736819 2.193862 0.80486
C  2.475718 -2.874475 0.150339
C  -0.038051 3.069626 -1.0758
C  -0.408908 -3.014658 -1.800382
C  4.859397 -0.388305 -0.331616
H  -4.259954 0.882614 -0.616367
H  -2.253203 1.382787 0.988142
H  -2.365023 -0.29655 1.514022
H  -4.114466 -1.617434 -0.587951
H  -5.724722 -1.072891 -0.033045
H  -4.515289 -1.635229 1.159296
H  -4.545044 2.19438 1.518097
H  -5.967513 1.144099 1.242271
H  -4.731547 0.67509 2.443722
H  3.21144 2.671388 -0.075624
H  2.077899 2.944077 1.272271
H  3.5439 1.921553 1.504376
H  3.293744 -2.873159 0.889223
H  1.732182 -3.64267 0.419486
H  2.91125 -3.164278 -0.826791
H  -0.501204 2.503751 -1.906616
H  1.010512 3.314724 -1.332797
H  -0.60237 3.99607 -0.888797
H  -0.887844 -2.251321 -2.439821
H  -1.01875 -3.930748 -1.773526
H  0.606749 -3.249842 -2.174742
H  5.857652 -0.502985 0.118219
H  4.795983 0.582676 -0.86111
H  4.676379 -1.209404 -1.052083
