program: Gaussian 09
title: 000256512
version: EM64L-G09RevD.01
frameworkgroup: C1[X(C21H24N4O2)]
method: RPBEPBE
basis: SDD
operation: Freq
keyword: #p
keyword: freq=noraman
keyword: PBEPBE/SDD
title: #p freq=noraman PBEPBE/SDD
converged: YES YES NO NO
title: Mulliken charges:
elementType: O O N N N N C C C C C C C C C C C C C C C C C C C C C H H H H H H H H H H H H H H H H H H H H H H H H
charge: -0.282798 -0.264074 -0.354468 -0.305379 0.003087 -0.018803 -0.467096 -0.336274 -0.348198 -0.222426 -0.184611 0.504826 0.375406 -0.332405 -0.385320 -0.446789 -0.354061 -0.220070 -0.217019 -0.348678 -0.362297 -0.347981 -0.373882 0.329849 0.313598 -0.544277 -0.536401 0.206204 0.203695 0.189041 0.250729 0.216107 0.228743 0.228670 0.255598 0.265237 0.259231 0.257036 0.253613 0.231231 0.271197 0.261736 0.251658 0.243124 0.271269 0.243970 0.221236 0.230815 0.243248 0.215148 0.228005
chargesum: 0.00000
title: Mulliken charges with hydrogens summed into heavy atoms:
elementType: O O N N N N C C C C C C C C C C C C C C C C C C C C C
charge: -0.282798 -0.264074 -0.089231 -0.046148 0.003087 -0.018803 -0.057198 0.103496 0.096652 0.006244 0.070987 0.504826 0.375406 -0.075369 -0.131706 -0.215558 -0.082864 -0.220070 -0.217019 -0.086942 -0.110639 -0.104857 -0.102613 0.329849 0.313598 0.151744 0.150001
polarizability: 2.96585008e+02 3.66308685e+01 2.94180182e+02 -1.44431383e-01 -1.52147377e+01 1.76216265e+02
1716.lowfreq: -0.0006 0.0002 0.0004 2.4416 6.8436 8.7345 19.0918 22.2067 25.8041
frequency: 17.8717 22.0912 25.6649 29.6525 39.2625 54.1264 61.0043 67.1643 89.1305 96.2237 102.7379 107.3756 115.6162 148.6500 157.3314 172.1583 184.7542 211.7101 218.3670 227.1771 234.4429 243.7837 253.6018 272.5918 298.4097 309.4685 334.1212 340.9783 358.4280 397.0706 414.5316 417.5406 426.3000 437.9712 466.2797 468.3241 487.4998 519.1620 529.0269 571.6005 579.8564 583.6156 605.0370 628.9403 629.9400 655.8879 667.8970 717.7062 735.7992 747.2663 754.6571 807.0717 812.6447 816.7773 827.1696 832.9641 839.9869 849.4639 884.3712 915.7117 927.9061 935.0995 958.3076 964.8272 971.0119 973.6983 985.1564 987.5602 999.9536 1004.7027 1007.7102 1049.1841 1061.6043 1111.2398 1112.5431 1113.0695 1114.1321 1118.3787 1130.8692 1139.3023 1155.5353 1158.1676 1176.6916 1182.0863 1194.3940 1197.0343 1211.1590 1213.0445 1226.1371 1232.9382 1253.1906 1275.7584 1281.3994 1293.5064 1299.9677 1309.7294 1314.1064 1354.4976 1361.1427 1376.6324 1380.1861 1394.6938 1416.3656 1419.0241 1436.1785 1437.5796 1440.1280 1452.0261 1465.5308 1467.9899 1472.2657 1472.3357 1474.8533 1482.3288 1486.7222 1501.2150 1502.7114 1587.2280 1590.7105 1621.0421 1622.2457 2163.8527 2193.2271 2838.0446 2866.3233 2900.0607 2957.8126 2963.2403 2965.0101 2974.6276 3016.3396 3033.2667 3044.7754 3048.7640 3052.8217 3118.9648 3123.9228 3124.5295 3136.1661 3145.3652 3149.3635 3164.9969 3166.1612 3168.9663 3170.1474 3421.8125 3438.7662
redmass: 6.6279 4.4223 5.0201 6.2674 4.3337 4.3786 4.2225 5.7156 5.9545 5.0150 4.4697 7.2691 4.1274 4.0513 3.2627 3.5668 3.0257 2.6662 2.1427 1.9923 2.1051 1.5891 2.4799 4.5546 3.2815 4.4330 4.3426 5.9110 4.4894 4.0097 2.9848 3.0764 6.0466 3.9458 4.5022 4.6117 3.6906 2.9526 3.2246 3.9259 5.4069 2.7855 3.0503 5.2555 6.8633 1.5498 2.1026 3.4532 3.8388 4.5202 4.8380 2.5472 1.3743 3.0689 2.1152 1.3138 1.5402 1.9351 2.8721 3.0718 2.1773 1.4597 1.3612 1.9728 1.8609 1.3682 7.8425 8.7109 2.6370 2.6478 2.2564 2.2273 2.9460 1.8069 1.2681 1.3133 1.5462 1.5093 2.7435 3.3594 1.3250 1.3384 1.2658 1.2627 1.7840 1.6674 1.4214 1.2910 3.4225 3.5427 1.7156 1.4495 1.1867 1.1723 1.2384 1.2903 1.3709 1.3695 1.4627 1.3507 5.3405 4.4890 3.4713 3.2510 1.1671 1.1785 1.1824 1.2245 1.0503 1.0505 1.1247 1.0789 1.0772 1.0844 1.0793 2.4183 2.3765 7.2703 7.0380 6.4693 6.2711 12.5581 12.6093 1.0793 1.0715 1.0700 1.0332 1.0328 1.0813 1.0616 1.0953 1.0930 1.1035 1.0900 1.1039 1.0900 1.0995 1.0999 1.0895 1.0886 1.0877 1.0936 1.0950 1.0960 1.0963 1.0748 1.0749
irintensity: 1.0446 0.8878 1.3855 2.1508 0.1379 0.4281 0.3452 1.3031 3.5238 2.8912 5.3993 3.6538 4.8397 0.7797 3.4070 5.9870 2.8713 2.1297 3.2748 3.1353 2.0358 1.1903 1.5405 1.7769 6.4613 1.2065 1.2536 2.1785 5.3992 2.1511 0.6524 0.6792 1.7302 3.9704 2.8780 0.2173 3.1095 13.3449 11.7461 16.6490 9.9069 28.0481 43.7279 17.6913 1.5071 63.3264 84.8254 2.4168 3.7467 3.4632 11.1743 12.4021 11.8800 46.0083 0.8980 14.8690 71.7059 28.0343 3.4265 27.8686 5.7965 0.1469 1.2172 1.5534 2.4623 1.2859 39.2449 35.4914 4.3061 12.8480 1.4505 17.2015 26.2366 4.4246 0.9283 1.6111 28.7875 8.3468 14.2849 48.2153 1.8313 1.3408 58.6140 67.5623 14.2028 16.6227 11.3293 11.7711 73.5630 240.6606 31.0915 3.7678 8.7869 10.3239 0.5230 0.6566 2.9295 2.0095 6.2023 3.1463 12.0111 9.1016 1.5255 6.9265 6.1797 9.7945 21.9661 41.9644 12.4041 14.8813 62.9427 36.0941 23.4076 7.5666 25.0857 105.4493 64.3422 7.9147 13.9891 60.5085 54.8902 5.9413 6.9001 67.1962 96.1992 74.6330 58.5237 62.9687 9.3992 56.2315 7.8262 33.8705 44.3391 34.6453 50.3843 16.0596 46.2396 3.3825 4.8003 3.1708 4.2920 13.1392 2.8003 0.9186 6.1728 1.0505 0.9644
temp: 298.150 k
press: 1.00000 atm
elementType: 8 8 7 7 7 7 6 6 6 6 6 6 6 6 6 6 6 6 6 6 6 6 6 6 6 6 6 1 1 1 1 1 1 1 1 1 1 1 1 1 1 1 1 1 1 1 1 1 1 1 1
symmnumber: 1
zpe: 1076794.8 jmol-1
zpe.correction: 0.410129 hartree
zpe.thermalcorrener: 0.437301 hartree
zpe.thermalcorrenthalpy: 0.438245 hartree
zpe.thermalcorrgfe: 0.349662 hartree
zpe.sumelectzpe: -1182.023358 hartree
zpe.sumelectthermal: -1181.996187 hartree
zpe.sumelectthermalent: -1181.995242 hartree
zpe.sumelectthermalfe: -1182.083826 hartree
dipole: 0.3037 -5.2941 5.2740
dipole: 7.4789
quadrupole: -182.5416 -158.7406 -160.5537
quadrupole: 26.9237 18.6418 -5.2512
quadrupole: -15.2630 8.5381 6.7249 26.9237 18.6418 -5.2512
hfenergy: -1182.4334876 hartree
pointgroup: C01 [X(C21H24N4O2)]
dipole: -0.3643697 -2.1787413 -1.9437756 debye
polarizability: 290.8890809|-35.8762999|301.2279033|-1.7996927|9.7594055|174.8644713 unknown
InChI: InChI=1S/C21H24N4O2/c1-26-18-8-4-16(5-9-18)20(14-22)24-12-3-13-25-21(15-23)17-6-10-19(27-2)11-7-17/h4-11,20-21,24-25H,3,12-13H2,1-2H3
charge 0 multiplicity 1
51 atoms
O  0.286007 -3.758124 0.543198
O  4.980596 -1.661068 -0.131287
N  -3.400308 1.478075 -0.062296
N  0.15541 2.623865 -0.701602
N  -5.598168 0.058561 2.202071
N  2.365433 5.190783 0.121221
C  -2.160509 3.146498 -1.441359
C  -2.696976 1.704077 -1.348343
C  -1.033859 3.465193 -0.437101
C  -3.970077 0.108114 0.076928
C  1.26567 2.73758 0.26894
C  -2.871443 -0.957642 0.196858
C  2.271778 1.587604 0.112327
C  -1.916296 -0.887742 1.243442
C  3.669858 1.785251 -0.002504
C  -2.785629 -2.008395 -0.739416
C  1.767335 0.267063 0.133378
C  -4.865805 0.084135 1.260958
C  1.924632 4.084819 0.218852
C  -0.891541 -1.84266 1.341101
C  4.543261 0.683722 -0.090174
C  -1.756322 -2.975955 -0.661509
C  2.62755 -0.848039 0.056301
C  -0.80121 -2.882679 0.379005
C  4.025626 -0.634734 -0.053837
C  0.377754 -4.900357 -0.372006
C  4.491964 -3.040693 -0.06825
H  -1.795106 3.31849 -2.474441
H  -2.987785 3.868759 -1.283847
H  -3.360164 1.503596 -2.227051
H  -1.84817 0.999698 -1.40431
H  -0.807518 4.556875 -0.480328
H  -1.386441 3.235756 0.586266
H  -4.60794 -0.17251 -0.801849
H  0.803671 2.66241 1.27613
H  -4.117792 2.196839 0.114581
H  0.492212 2.690624 -1.672455
H  -1.977599 -0.070979 1.970534
H  4.082032 2.800669 -0.019822
H  -3.522856 -2.076205 -1.549184
H  0.686038 0.11351 0.202161
H  -0.147432 -1.80281 2.142433
H  5.624948 0.821013 -0.180071
H  -1.709063 -3.773146 -1.408958
H  2.201164 -1.85529 0.094438
H  1.25895 -5.46729 -0.037401
H  0.520607 -4.568773 -1.419002
H  -0.522854 -5.540132 -0.30468
H  5.394481 -3.667213 -0.12117
H  3.825632 -3.270939 -0.923153
H  3.953453 -3.235101 0.879481
