program: Gaussian 09
title: 000256511
version: EM64L-G09RevD.01
frameworkgroup: C1[X(C20H20N4)]
method: RPBEPBE
basis: SDD
operation: Freq
keyword: #pfreq=noraman
keyword: PBEPBE/SDD
title: #p freq=noraman PBEPBE/SDD
converged: YES YES NO NO
title: Mulliken charges:
elementType: N N N N C C C C C C C C C C C C C C C C C C C C H H H H H H H H H H H H H H H H H H H H
charge: -0.091003 -0.091060 -0.004862 -0.004868 -0.348145 -0.398059 -0.398029 -0.404220 -0.187131 -0.187120 0.369699 0.369802 -0.222511 -0.222396 -0.371028 -0.371037 -0.392709 -0.392838 -0.232713 -0.232711 -0.231158 -0.231145 -0.237387 -0.237383 0.214402 0.216491 0.216051 0.253560 0.253558 0.216027 0.225130 0.201266 0.263382 0.263338 0.265064 0.265073 0.254996 0.255005 0.229931 0.229935 0.231189 0.231193 0.232212 0.232211
chargesum: 0.00000
title: Mulliken charges with hydrogens summed into heavy atoms:
elementType: N N N N C C C C C C C C C C C C C C C C C C C C
charge: -0.091003 -0.091060 -0.004862 -0.004868 0.082747 0.071552 0.071556 0.022177 0.076252 0.076218 0.369699 0.369802 -0.222511 -0.222396 -0.105964 -0.105964 -0.137713 -0.137834 -0.002781 -0.002776 0.000031 0.000048 -0.005175 -0.005172
polarizability: 2.93342872e+02 -2.39890293e-02 2.53476715e+02 -6.93581544e-03 1.21128640e+00 1.35221716e+02
1716.lowfreq: -9.0656 -5.0917 -0.0006 -0.0005 -0.0003 4.0052 18.8116 26.1927 26.4383
frequency: 18.7353 26.1300 26.4148 28.0934 64.9357 64.9563 93.9880 99.9335 101.6627 118.4081 161.9466 165.2807 194.8561 217.0333 231.1835 275.1290 291.8214 301.4284 314.5165 346.2758 371.0167 405.1316 405.3565 412.1785 426.6159 437.6197 448.2774 481.3801 486.5636 493.5717 615.5145 615.6483 617.8444 636.7884 664.4297 698.3577 703.6587 715.3351 737.1644 741.6643 772.1244 804.1573 826.3583 860.1117 861.0764 863.6849 894.7242 907.8038 915.4128 922.3829 936.2877 942.1679 960.1575 985.0579 985.3066 990.5316 990.7659 1001.1424 1001.4264 1020.6265 1027.7700 1030.5806 1040.0606 1077.4522 1082.3693 1088.9421 1090.7829 1124.9887 1153.8690 1172.9222 1173.1086 1183.2468 1184.5481 1187.3536 1188.5610 1193.6188 1197.0156 1226.7861 1248.4303 1249.7259 1295.6028 1308.9027 1309.8703 1321.0811 1321.7001 1325.4393 1348.7086 1358.2000 1374.9592 1383.2765 1383.6524 1407.9255 1436.9428 1437.0717 1448.9365 1469.8496 1470.9709 1480.1164 1481.4100 1482.0437 1595.1060 1595.2126 1613.1074 1613.3491 2166.1988 2166.4078 2775.8831 2881.4579 2886.3450 2960.9544 2960.9891 3009.1949 3019.0804 3058.5949 3061.4312 3076.0843 3126.3862 3126.4102 3132.6983 3132.7236 3143.4347 3143.4765 3152.8545 3152.9256 3166.6296 3166.7147
redmass: 4.8966 3.8021 4.4950 7.8708 5.3366 4.7139 4.9859 9.1535 5.1608 8.7264 3.0847 4.7884 4.0337 5.1739 4.2103 2.1108 4.0368 5.4337 5.0922 5.7571 2.1092 2.8957 2.8619 5.5674 6.2211 4.8228 5.1175 4.0582 3.9406 2.3103 6.4736 6.4280 7.9032 6.1927 5.6239 3.3238 2.2280 1.7395 1.7584 2.1916 2.7947 2.8825 3.8496 1.3379 1.2444 2.8757 1.7848 4.9673 2.7426 1.9898 1.5337 1.8302 2.5075 1.3997 1.3988 5.8818 5.8919 1.3218 1.3209 2.3169 2.2158 2.0702 2.5841 1.9331 1.7292 1.6885 1.9239 3.8672 2.9805 1.0662 1.0653 1.7600 1.3198 1.1014 1.3876 1.4837 1.9063 1.4862 1.4986 1.8349 1.2987 1.3240 1.3378 1.3272 1.2983 1.4546 1.3368 1.3617 1.4282 8.6101 7.6044 1.3120 2.2114 2.2121 1.0910 1.0779 1.0912 1.2608 2.2442 1.7642 6.3100 6.3090 6.0095 5.9938 12.5728 12.5716 1.0699 1.0708 1.0701 1.0811 1.0812 1.0605 1.0871 1.0889 1.0909 1.1034 1.0849 1.0849 1.0880 1.0880 1.0922 1.0921 1.0962 1.0962 1.1016 1.1016
irintensity: 0.1647 0.1139 0.1841 0.3385 1.8604 0.6871 5.6318 0.2701 0.2708 4.7854 1.0410 0.9833 1.6293 1.8335 0.6629 2.9676 0.0480 1.7531 0.0016 0.0003 9.0375 0.1323 0.1546 0.6922 1.3993 3.7507 3.4632 0.2432 8.2030 2.1796 1.4028 0.1009 31.2858 3.3441 1.3835 4.2335 7.8743 147.1141 7.8439 26.2857 37.3985 0.0847 12.6808 0.0306 0.8507 1.6809 11.3300 35.0047 0.9589 0.8504 2.2895 7.3266 29.4895 0.0919 0.3846 1.0363 0.9462 1.8276 1.3758 8.8871 27.8269 12.0656 44.9574 10.7952 79.7549 3.3113 83.7827 3.7478 5.3529 1.0601 0.3148 4.2313 14.4808 2.7769 14.5563 0.1069 17.2317 8.1051 16.4059 18.7714 5.1823 17.3051 0.1210 7.4368 1.8542 18.0401 0.1568 0.6369 0.5900 0.5005 0.1240 14.8493 12.7725 19.0212 11.1549 1.8308 12.7814 0.8849 22.5278 22.7310 0.2163 0.6358 6.3444 3.9530 2.8484 3.2904 61.3900 2.0641 89.4487 0.9863 13.2550 26.3255 27.0247 27.0442 20.2121 28.3058 0.3619 0.9446 3.0691 0.7822 5.1732 17.7949 26.0993 22.2535 28.5269 20.6327
temp: 298.150 k
press: 1.00000 atm
elementType: 7 7 7 7 6 6 6 6 6 6 6 6 6 6 6 6 6 6 6 6 6 6 6 6 1 1 1 1 1 1 1 1 1 1 1 1 1 1 1 1 1 1 1 1
symmnumber: 1
zpe: 929202.9 jmol-1
zpe.correction: 0.353915 hartree
zpe.thermalcorrener: 0.375399 hartree
zpe.thermalcorrenthalpy: 0.376343 hartree
zpe.thermalcorrgfe: 0.300507 hartree
zpe.sumelectzpe: -991.361733 hartree
zpe.sumelectthermal: -991.340249 hartree
zpe.sumelectthermalent: -991.339304 hartree
zpe.sumelectthermalfe: -991.415140 hartree
dipole: 0.0029 -6.2650 -0.1026
dipole: 6.2659
quadrupole: -130.1749 -160.3707 -138.6340
quadrupole: 0.0114 0.0018 -0.9295
quadrupole: 12.8850 -17.3108 4.4258 0.0114 0.0018 -0.9295
hfenergy: -991.7156473 hartree
pointgroup: C01 [X(C20H20N4)]
dipole: 0.0005211 -2.4470962 -0.2980891 debye
polarizability: 293.342857|-0.0335563|251.9294973|-0.0074368|13.4922669|136.768948 unknown
InChI: InChI=1S/C20H20N4/c21-14-19(17-8-3-1-4-9-17)23-12-7-13-24(16-23)20(15-22)18-10-5-2-6-11-18/h1-6,8-11,19-20H,7,12-13,16H2
charge 0 multiplicity 1
44 atoms
N  1.21025 0.327953 0.082615
N  -1.209721 0.328497 0.082591
N  3.0404 3.304747 0.256587
N  -3.042145 3.305269 0.256636
C  0.00043 1.052451 -0.370237
C  1.268323 0.231235 1.566191
C  -1.267883 0.231816 1.566164
C  0.000052 -0.479602 2.075391
C  2.456299 0.806287 -0.562689
C  -2.455545 0.807272 -0.5628
C  3.614031 -0.194384 -0.387441
C  -3.613728 -0.192854 -0.387433
C  2.834431 2.192337 -0.125119
C  -2.833026 2.193572 -0.125445
C  3.35378 -1.565004 -0.638237
C  -3.354104 -1.563646 -0.637933
C  4.921736 0.213617 -0.037299
C  -4.921267 0.215831 -0.037474
C  4.391672 -2.51558 -0.53801
C  -4.39245 -2.513714 -0.537593
C  5.961509 -0.740234 0.061725
C  -5.961499 -0.737508 0.061661
C  5.700877 -2.105722 -0.188965
C  -5.70149 -2.103169 -0.188734
H  0.000667 2.112134 0.014875
H  0.000452 1.087937 -1.475737
H  1.345591 1.244874 2.031351
H  2.170997 -0.337918 1.845251
H  -2.170828 -0.336916 1.845206
H  -1.344689 1.245494 2.031312
H  -0.000184 -1.525516 1.720214
H  0.00004 -0.485791 3.18116
H  2.236017 0.87922 -1.649157
H  -2.235216 0.879966 -1.649274
H  2.332081 -1.871557 -0.887797
H  -2.332531 -1.870729 -0.887359
H  5.131671 1.27078 0.162108
H  -5.130715 1.273136 0.161705
H  4.181453 -3.573431 -0.731372
H  -4.182715 -3.571703 -0.730725
H  6.970841 -0.415071 0.336761
H  -6.970698 -0.411814 0.336554
H  6.507073 -2.843603 -0.111223
H  -6.508039 -2.840656 -0.110905
