program: Gaussian 09
title: 000256501
version: EM64L-G09RevD.01
frameworkgroup: C1[X(C12H27N)]
method: RPBEPBE
basis: SDD
operation: Freq
keyword: #pfreq=noraman
keyword: PBEPBE/SDD
title: #p freq=noraman PBEPBE/SDD
converged: YES YES NO NO
title: Mulliken charges:
elementType: N C C C C C C C C C C C C H H H H H H H H H H H H H H H H H H H H H H H H H H H
charge: -0.564834 0.519035 -0.456816 -0.455806 -0.455618 -0.468675 -0.400788 -0.400743 -0.402850 -0.445972 -0.699123 -0.698793 -0.699568 0.190786 0.188943 0.190963 0.185425 0.186691 0.186069 0.223269 0.183550 0.208314 0.208277 0.204174 0.210665 0.206569 0.218856 0.221062 0.194821 0.215123 0.208419 0.209447 0.209307 0.215198 0.208475 0.216361 0.207739 0.207741 0.256358 0.267950
chargesum: 0.00000
title: Mulliken charges with hydrogens summed into heavy atoms:
elementType: N C C C C C C C C C C C C
charge: -0.040525 0.519035 -0.077087 -0.079418 -0.082858 -0.061856 0.015803 0.014096 0.022576 -0.030090 -0.066135 -0.065813 -0.067727
polarizability: 1.46871748e+02 -5.77954336e-01 1.44297190e+02 8.34967353e-01 7.48548706e-01 1.21035742e+02
1716.lowfreq: -31.5290 -16.0550 -12.5622 -0.0005 0.0006 0.0007 13.1234 48.9348 55.2962
frequency: -21.7122 48.6053 55.0162 59.2980 62.6236 77.1022 86.1828 101.7868 128.2879 208.6198 224.2739 232.7620 234.2192 245.5802 253.9108 262.5609 295.5764 312.7683 328.4343 332.2918 338.6563 351.9058 453.8291 561.9708 573.7017 612.2340 721.8430 736.3150 740.7423 776.3785 782.5790 834.0161 846.7806 860.4367 881.6255 893.3543 925.3802 952.9234 969.3677 999.7258 1033.0103 1038.7827 1053.5817 1054.9408 1073.6436 1085.8484 1089.5986 1107.8335 1109.5300 1130.5973 1171.0854 1181.2497 1193.2531 1229.3304 1236.1661 1242.6099 1256.1972 1279.6654 1285.3260 1285.8301 1290.5496 1297.4658 1309.1069 1316.8980 1336.0237 1353.1680 1356.7884 1361.7312 1387.3937 1389.3675 1390.1208 1390.8127 1465.2920 1466.1541 1470.5717 1473.4545 1475.8337 1477.5103 1477.7692 1478.3804 1479.6199 1480.6882 1486.1191 1489.8198 1493.4960 1499.2772 1637.1606 2875.8849 2959.5768 2959.7304 2961.5480 2967.7395 2969.2896 2969.7610 2970.1831 2971.2897 2972.1306 2977.4017 2995.4427 3000.1449 3001.6917 3010.7067 3021.5043 3028.4728 3030.7124 3036.0749 3065.3775 3066.6952 3067.7527 3068.9917 3069.0544 3069.4308 3441.3576 3568.5828
redmass: 2.0257 2.2575 1.8976 2.4994 2.9607 1.8312 3.3313 1.8286 3.1129 1.5349 1.4044 1.5317 1.1305 1.7475 1.5263 1.5615 3.1868 3.6989 2.5670 2.2881 2.1637 3.0091 2.7055 2.2745 2.3134 1.3028 1.0992 1.1289 1.1699 2.3216 1.3869 1.4426 1.6803 1.4561 1.4489 1.7513 1.7551 1.7163 1.8304 1.6645 1.8681 2.1703 2.6368 2.6654 1.7522 1.9356 2.2511 1.7870 2.2572 1.7723 2.1419 2.3542 2.5210 1.3450 1.2962 1.2665 1.3230 1.1114 1.2256 1.2144 1.1889 1.3571 1.2796 1.2639 1.4143 1.5244 1.5058 1.4498 1.3856 1.2490 1.2116 1.2114 1.0702 1.0679 1.0701 1.0676 1.0618 1.0430 1.0436 1.0438 1.0599 1.0659 1.0746 1.0859 1.0786 1.0865 1.0931 1.0712 1.0587 1.0594 1.0624 1.0572 1.0431 1.0405 1.0386 1.0505 1.0575 1.0602 1.0974 1.0967 1.0964 1.0852 1.1021 1.1016 1.1015 1.0972 1.1007 1.1006 1.1007 1.0994 1.0993 1.0992 1.0446 1.0972
irintensity: 0.0300 0.1023 0.5845 0.0341 0.2239 0.7843 0.1158 3.8677 0.3559 3.7416 2.7719 10.3680 8.1835 1.0149 1.5146 19.4702 4.4520 1.3576 0.1176 1.7979 5.2313 2.9816 6.9186 7.9628 7.8789 201.3809 0.7053 5.7940 17.7058 1.1794 5.2472 0.7147 0.5034 2.1157 2.8154 4.2868 0.9000 2.9589 5.2494 6.1756 1.1344 0.8896 0.8993 0.0529 3.5347 7.5187 16.4444 1.2019 5.6003 5.8829 4.3144 6.1444 2.5969 0.2832 0.6727 0.1012 0.6650 0.1767 2.0601 1.6187 3.0599 0.6179 0.9316 3.1884 2.6408 1.7258 0.9456 0.5377 8.9218 11.0842 8.3255 12.4291 2.0645 1.1845 1.3062 1.9321 0.3045 6.7073 15.5636 20.7839 2.8876 0.6309 3.7426 6.5070 52.4022 2.3758 40.3835 93.5076 4.3489 7.3118 4.8207 13.1546 24.9424 37.7387 64.6026 15.0755 4.0100 167.6307 4.8940 14.4917 5.0199 29.6947 2.5348 79.9205 24.1576 79.8747 36.6877 138.7752 53.4351 46.6910 62.2501 63.9303 2.7129 0.0835
temp: 298.150 k
press: 1.00000 atm
elementType: 7 6 6 6 6 6 6 6 6 6 6 6 6 1 1 1 1 1 1 1 1 1 1 1 1 1 1 1 1 1 1 1 1 1 1 1 1 1 1 1
symmnumber: 1
zpe: 969745.9 jmol-1
zpe.correction: 0.369357 hartree
zpe.thermalcorrener: 0.386627 hartree
zpe.thermalcorrenthalpy: 0.387572 hartree
zpe.thermalcorrgfe: 0.324381 hartree
zpe.sumelectzpe: -527.096873 hartree
zpe.sumelectthermal: -527.079602 hartree
zpe.sumelectthermalent: -527.078658 hartree
zpe.sumelectthermalfe: -527.141849 hartree
dipole: -0.5525 -0.9297 0.5676
dipole: 1.2214
quadrupole: -88.6975 -80.0749 -88.7262
quadrupole: -1.6319 3.3091 0.6103
quadrupole: -2.8646 5.7579 -2.8933 -1.6319 3.3091 0.6103
hfenergy: -527.4662293 hartree
pointgroup: C01 [X(C12H27N1)]
dipole: -0.2121992 0.3636055 -0.2316537 debye
polarizability: 146.8941957|0.5382527|144.3069838|-0.6088786|0.3499617|121.0035006 unknown
InChI: InChI=1S/C12H27N/c1-4-7-12(8-5-2,9-6-3)10-11-13/h4-11,13H2,1-3H3
charge 0 multiplicity 1
40 atoms
N  2.318192 2.880875 1.297684
C  -0.011616 0.014989 -0.002598
C  -0.783673 -0.976658 0.932611
C  -1.000856 0.761937 -0.960136
C  1.002037 -0.753611 -0.916932
C  0.738314 1.015591 0.937057
C  -1.682776 -2.034555 0.251915
C  -2.119108 1.604669 -0.304411
C  2.117577 -1.558459 -0.209988
C  1.655097 2.056418 0.261639
C  -2.366843 -2.960658 1.282118
C  -3.027401 2.279679 -1.356339
C  3.04724 -2.267616 -1.219639
H  -0.045107 -1.50305 1.571515
H  -1.410384 -0.386366 1.633579
H  -1.475227 0.010998 -1.62569
H  -0.414524 1.423162 -1.631774
H  0.433874 -1.443584 -1.575104
H  1.480716 -0.022592 -1.602079
H  1.360568 0.450061 1.657182
H  -0.014324 1.555948 1.549952
H  -1.08458 -2.651471 -0.447475
H  -2.460207 -1.53429 -0.358697
H  -1.676738 2.385373 0.345861
H  -2.741014 0.965885 0.353485
H  1.671051 -2.315175 0.464903
H  2.722414 -0.886827 0.430557
H  2.447639 1.537227 -0.309739
H  1.065927 2.656506 -0.473645
H  -3.006413 -3.715071 0.78764
H  -3.003672 -2.380245 1.976557
H  -1.615851 -3.499764 1.890546
H  -3.511036 1.524735 -2.005084
H  -3.826463 2.876925 -0.879285
H  -2.443902 2.955832 -2.009801
H  3.845685 -2.834593 -0.706206
H  2.480616 -2.97797 -1.851534
H  3.532434 -1.535845 -1.893615
H  1.657124 3.35934 1.919995
H  3.025415 3.52705 0.932179
