program: Gaussian 09
title: 000256497
version: EM64L-G09RevD.01
frameworkgroup: C1[X(C18H36N4O2)]
method: RPBEPBE
basis: SDD
operation: Freq
keyword: #p
keyword: freq=noraman
keyword: PBEPBE/SDD
title: #p freq=noraman PBEPBE/SDD
converged: YES YES NO NO
title: Mulliken charges:
elementType: O O N N N N C C C C C C C C C C C C C C C C C C H H H H H H H H H H H H H H H H H H H H H H H H H H H H H H H H H H H H
charge: -0.282435 -0.282421 -0.156330 -0.156293 -0.309278 -0.309165 -0.084815 -0.084944 -0.433805 -0.433728 -0.359404 -0.359465 -0.375691 -0.375665 0.227282 0.227288 -0.355919 -0.355959 -0.356675 -0.356653 -0.749113 -0.749113 -0.695412 -0.695417 0.275853 0.275948 0.182378 0.263324 0.182367 0.263332 0.276634 0.276599 0.203507 0.208957 0.203548 0.208904 0.198060 0.187275 0.198088 0.187256 0.193420 0.187261 0.187257 0.193433 0.193456 0.197764 0.193448 0.197771 0.247934 0.234804 0.244162 0.247935 0.234814 0.244164 0.211492 0.216200 0.209045 0.211494 0.216202 0.209044
chargesum: 0.00000
title: Mulliken charges with hydrogens summed into heavy atoms:
elementType: O O N N N N C C C C C C C C C C C C C C C C C C
charge: -0.282435 -0.282421 -0.156330 -0.156293 -0.032644 -0.032567 0.191037 0.191004 0.011897 0.011971 0.053061 0.052987 0.009644 0.009679 0.227282 0.227288 0.024762 0.024731 0.034544 0.034567 -0.022213 -0.022201 -0.058675 -0.058677
polarizability: 2.87136185e+02 -2.96352373e+00 2.16915373e+02 4.96377456e-03 -1.49794832e-02 1.94535217e+02
1716.lowfreq: -10.4843 -3.0676 -0.0013 0.0009 0.0011 4.6855 10.6796 22.7823 32.1130
frequency: 10.5029 22.7348 32.1002 36.6925 37.2998 38.2816 39.2585 63.4266 66.4667 76.5136 79.0156 85.5495 95.2719 101.8396 103.3832 112.4588 112.5381 128.0618 134.8032 141.9739 158.1945 180.5473 200.4211 213.5707 220.9842 228.5852 228.7290 267.6289 276.2176 280.0127 336.3457 367.7700 391.0604 397.0281 411.2697 418.0543 457.3413 481.6753 494.6930 504.7458 533.3741 554.3007 573.3920 576.5451 611.6367 627.6321 680.4968 681.3827 724.1008 724.1288 739.0251 739.3605 778.2058 786.0742 808.1719 846.9375 863.7539 870.3764 889.5630 889.6271 921.3721 926.5102 958.2700 960.3522 1001.4517 1004.2648 1017.8056 1018.1784 1030.4915 1031.5319 1032.7038 1032.9910 1042.2685 1048.3919 1064.8004 1066.5281 1080.5879 1080.6994 1091.7900 1102.5494 1122.0909 1127.2464 1142.2820 1164.1544 1176.5417 1182.4512 1198.3726 1198.5487 1229.3327 1229.8000 1243.1878 1243.8804 1273.7023 1274.1881 1283.5982 1283.8551 1286.0955 1286.7112 1292.2160 1292.8231 1304.7577 1317.6856 1323.9390 1324.0790 1345.8936 1346.9112 1348.7151 1350.1550 1355.4121 1355.4790 1358.6479 1361.4170 1378.8458 1379.4092 1389.6768 1389.7183 1440.3664 1441.3775 1450.2212 1452.6213 1454.2095 1454.6652 1463.4317 1463.7344 1465.8426 1466.0688 1469.8778 1474.3575 1474.7364 1476.9125 1476.9322 1476.9878 1483.0983 1483.1216 1488.8572 1488.8631 1590.8432 1595.0008 2950.8198 2950.8730 2953.5189 2953.9454 2955.7131 2955.7328 2967.3680 2967.3729 2972.1050 2972.1351 2973.7655 2973.7930 2988.5474 2988.5708 3003.0110 3003.0447 3003.7543 3003.7726 3019.8707 3020.6733 3023.4706 3023.4979 3038.2445 3038.2848 3062.9311 3063.0394 3068.6559 3068.6794 3071.4336 3071.4494 3091.1825 3091.2422 3132.0294 3132.1229 3393.1045 3398.5948
redmass: 4.4412 4.0881 4.3315 3.6589 1.7447 1.5953 2.8221 1.6431 3.6151 2.5784 1.2277 3.5087 2.0988 2.8763 2.7965 1.6605 1.7035 3.8132 2.4367 2.3598 4.6274 2.5739 4.8208 3.2581 3.5958 1.1264 1.1287 3.1718 3.2982 3.1297 4.4364 3.5158 3.4172 3.4877 2.9795 3.8616 3.8445 3.0792 3.9493 3.8654 1.6447 3.8991 2.9598 3.2249 2.4406 3.8911 2.9859 3.1832 1.0647 1.0646 1.1088 1.1089 1.3895 1.2132 2.1032 4.8881 1.3398 1.3911 1.8645 1.8747 2.6855 3.0114 1.4621 1.4121 2.7571 2.3676 1.8663 1.6889 2.7851 1.7911 1.6837 2.6349 2.1652 2.0552 2.9824 2.8803 2.1918 2.2007 2.6607 2.5023 2.7885 2.9515 4.4007 2.2711 2.4324 3.6435 1.6937 1.6265 1.2999 1.3056 1.3217 1.3490 1.2375 1.2190 1.2618 1.2205 1.0888 1.0960 1.1355 1.1134 1.3731 1.4044 1.3219 1.3124 1.9764 1.7526 1.6264 2.0062 1.6410 1.6327 1.4706 1.4903 1.2772 1.3038 1.2163 1.2164 1.0905 1.0783 1.2265 1.0980 1.0642 1.0832 1.0815 1.0714 1.0831 1.0790 1.1580 1.0846 1.0743 1.0451 1.0465 1.2252 1.0817 1.0833 1.0915 1.0915 7.2701 7.2469 1.0605 1.0603 1.0662 1.0664 1.0592 1.0592 1.0593 1.0593 1.0370 1.0370 1.0592 1.0592 1.0968 1.0968 1.0365 1.0365 1.1001 1.1000 1.0853 1.0856 1.1020 1.1020 1.1023 1.1023 1.0969 1.0970 1.1007 1.1007 1.0993 1.0993 1.0970 1.0970 1.1013 1.1012 1.0762 1.0755
irintensity: 0.0325 0.1161 0.0698 1.7955 0.0162 0.0736 0.0176 2.5494 0.0053 1.4213 2.3920 1.3520 0.2522 2.6534 2.4684 0.1729 0.4095 1.2434 0.4345 0.9188 0.9410 4.0457 1.6810 1.4586 1.4062 0.0043 0.0595 4.0668 2.4032 8.3322 0.4493 0.3672 2.5884 2.2035 3.1732 0.0058 1.5771 12.1941 1.4718 12.8769 147.2347 4.1576 10.3520 2.3957 3.9218 8.1049 161.4724 15.7695 12.8660 12.9999 0.5651 0.2016 6.9224 3.3437 0.0496 8.4612 0.8573 0.0253 3.2212 4.2421 4.2273 1.1001 2.4195 2.6594 0.2978 0.0691 0.1241 0.1683 6.0679 11.2725 8.3626 4.5919 0.0829 5.2586 0.6487 2.7223 0.0297 0.8260 3.5381 51.2128 4.6999 3.8314 97.3232 0.0045 17.6386 3.5230 2.6690 1.8402 1.2345 20.8161 5.0780 3.8208 0.6584 1.9797 4.2323 9.8512 5.5844 0.7253 3.0510 0.6322 20.6923 6.2924 10.2262 0.1320 47.7263 75.0812 42.2222 114.5457 0.6486 7.7986 4.6892 6.4083 10.3734 103.1889 12.1004 10.5961 86.9444 26.4959 2.3884 37.5633 30.9668 1.3358 0.6394 0.7303 0.1099 2.0423 0.0842 6.9148 0.3914 15.1311 15.7887 21.4603 0.0145 1.7887 27.2987 20.6146 291.2989 120.5325 0.7131 0.1040 7.1082 22.0912 13.4102 12.2249 50.5417 38.3939 57.5381 6.6036 94.8901 92.3585 1.2588 1.1366 0.3551 11.6699 0.1591 0.2034 12.5676 15.7157 1.9475 1.9690 59.9292 78.8535 30.5039 22.5290 105.5550 94.8861 44.8197 65.1978 11.5382 13.5030 20.0557 11.3322 2.5422 0.2498
temp: 298.150 k
press: 1.00000 atm
elementType: 8 8 7 7 7 7 6 6 6 6 6 6 6 6 6 6 6 6 6 6 6 6 6 6 1 1 1 1 1 1 1 1 1 1 1 1 1 1 1 1 1 1 1 1 1 1 1 1 1 1 1 1 1 1 1 1 1 1 1 1
symmnumber: 1
zpe: 1382195.1 jmol-1
zpe.correction: 0.526450 hartree
zpe.thermalcorrener: 0.556577 hartree
zpe.thermalcorrenthalpy: 0.557521 hartree
zpe.thermalcorrgfe: 0.460291 hartree
zpe.sumelectzpe: -1074.987525 hartree
zpe.sumelectthermal: -1074.957398 hartree
zpe.sumelectthermalent: -1074.956454 hartree
zpe.sumelectthermalfe: -1075.053683 hartree
dipole: 0.0035 -0.0057 -5.0972
dipole: 5.0972
quadrupole: -148.4532 -159.9630 -158.1642
quadrupole: -11.7864 0.0122 -0.0067
quadrupole: 7.0736 -4.4362 -2.6374 -11.7864 0.0122 -0.0067
hfenergy: -1075.5139749 hartree
pointgroup: C01 [X(C18H36N4O2)]
dipole: 0.0013517 -0.0051027 -2.0054022 debye
polarizability: 287.1028549|-3.3349305|216.9486142|0.0096589|-0.046995|194.535306 unknown
InChI: InChI=1S/C18H36N4O2/c1-5-7-9-11-13-17-19-22(16(4)24)18(14-12-10-8-6-2)20-21(17)15(3)23/h17-20H,5-14H2,1-4H3
charge 0 multiplicity 1
60 atoms
O  -1.429504 -2.647913 2.120511
O  1.427946 2.658808 2.10913
N  -0.284137 -1.328551 0.621889
N  0.284472 1.332331 0.615334
N  0.944088 -0.928639 0.026044
N  -0.943122 0.929333 0.020258
C  -1.449591 -0.359238 0.534932
C  1.450049 0.362664 0.534382
C  -2.582933 -0.890283 -0.362542
C  2.583915 0.889192 -0.365128
C  -3.85525 -0.013833 -0.318729
C  3.855788 0.012306 -0.3176
C  -4.979162 -0.553092 -1.231533
C  4.979828 0.547283 -1.232783
C  -0.342821 -2.407275 1.508501
C  0.342106 2.415384 1.496731
C  -6.261694 0.307593 -1.185721
C  6.261751 -0.314141 -1.184322
C  -7.384231 -0.217975 -2.109511
C  7.384285 0.207388 -2.110418
C  0.915948 -3.244572 1.669172
C  -0.917087 3.25299 1.652329
C  -8.659626 0.650923 -2.060878
C  8.659009 -0.662356 -2.059518
H  -1.829729 -0.229709 1.565261
H  1.829434 0.238587 1.565655
H  -2.213951 -0.983221 -1.407478
H  -2.821305 -1.910288 -0.011613
H  2.215109 0.977901 -1.410498
H  2.822726 1.910579 -0.018531
H  0.898449 -0.965478 -1.003365
H  -0.896204 0.960546 -1.00928
H  -4.22294 0.03074 0.7269
H  -3.608556 1.027099 -0.607239
H  4.223569 -0.028114 0.728162
H  3.608596 -1.029702 -0.601757
H  -5.224553 -1.594374 -0.936126
H  -4.611439 -0.605072 -2.278284
H  5.22607 1.589487 -0.941368
H  4.611725 0.595645 -2.279578
H  -6.637892 0.351001 -0.142332
H  -6.014829 1.352116 -1.470314
H  6.014066 -1.359496 -1.465112
H  6.638346 -0.354107 -0.14094
H  -7.006444 -0.264525 -3.151556
H  -7.633486 -1.259981 -1.822726
H  7.006005 0.25074 -3.152424
H  7.634507 1.250157 -1.827271
H  0.697053 -4.059015 2.376014
H  1.241292 -3.665663 0.702343
H  1.753706 -2.634476 2.049518
H  -0.699212 4.070645 2.355771
H  -1.241543 3.66965 0.68329
H  -1.755047 2.644313 2.034508
H  -9.074592 0.688492 -1.035949
H  -9.446254 0.254863 -2.729166
H  -8.443142 1.690414 -2.37238
H  9.074566 -0.696728 -1.034717
H  9.445552 -0.269217 -2.72963
H  8.441519 -1.70274 -2.367314
