program: Gaussian 09
title: 000256495
version: EM64L-G09RevD.01
frameworkgroup: C1[X(C16H29NO2)]
method: RPBEPBE
basis: SDD
operation: Freq
keyword: #p
keyword: freq=noraman
keyword: PBEPBE/SDD
title: #p freq=noraman PBEPBE/SDD
converged: YES YES NO NO
title: Mulliken charges:
elementType: O O N C C C C C C C C C C C C C C C C H H H H H H H H H H H H H H H H H H H H H H H H H H H H H
charge: -0.268919 -0.210774 -0.010445 0.402397 -0.463246 -0.490490 -0.433637 -0.241787 -0.369308 -0.395119 -0.743704 -0.351654 -0.351399 0.191475 -0.213545 -0.702487 -0.701663 -0.260063 -0.666304 0.186971 0.214643 0.195789 0.228662 0.214660 0.217391 0.281634 0.233564 0.191560 0.207089 0.201746 0.226632 0.217900 0.232902 0.199845 0.185190 0.194575 0.201686 0.219823 0.212145 0.209121 0.211309 0.219357 0.209025 0.240481 0.228158 0.248216 0.226899 0.223698
chargesum: 0.00000
title: Mulliken charges with hydrogens summed into heavy atoms:
elementType: O O N C C C C C C C C C C C C C C C C
charge: -0.268919 -0.210774 -0.010445 0.402397 -0.061632 -0.066038 -0.001586 0.039847 0.055816 0.013716 -0.066269 0.033381 0.044862 0.191475 -0.213545 -0.061399 -0.061972 0.208576 0.032509
polarizability: 2.02440277e+02 5.26042771e+00 1.84712028e+02 6.21551870e+00 8.43658390e+00 1.62086076e+02
1716.lowfreq: -8.1643 -0.0005 -0.0002 0.0005 3.9837 8.7750 17.3804 26.6706 40.4576
frequency: 16.9422 25.9386 40.4429 49.3248 51.5584 64.1157 73.0189 76.3081 90.7533 96.2770 115.7966 121.0951 129.9247 138.6210 163.7093 181.8932 207.7609 208.5631 227.8358 229.0459 235.4540 245.6266 272.8777 297.5069 310.4027 314.0327 327.3096 345.7815 398.1582 424.5695 429.5892 471.6653 476.3405 518.8234 577.0762 675.9201 697.0538 724.5402 731.0190 759.0381 775.6763 785.7843 788.7922 804.8514 825.6624 852.4593 893.5595 894.6788 901.7303 921.3089 948.4788 969.8275 982.1950 1007.2042 1024.1670 1038.3194 1045.3711 1060.5248 1077.3021 1083.1442 1087.3547 1088.6398 1094.0996 1104.0749 1109.5672 1154.7846 1156.4104 1158.2299 1188.1123 1218.4882 1229.0006 1251.7210 1266.7175 1270.8193 1276.2565 1277.9989 1290.3758 1295.0275 1302.4200 1304.0747 1321.0145 1337.4736 1340.6734 1344.0975 1355.1529 1360.6571 1365.1923 1390.0998 1390.2527 1392.7936 1393.7764 1456.6509 1458.3326 1462.7282 1464.5485 1467.2165 1469.5837 1472.4693 1475.6392 1476.4377 1478.1683 1482.0365 1483.1578 1484.8191 1487.3432 1491.2769 1493.4251 1642.0904 2193.5707 2958.1426 2963.1136 2965.5677 2970.3328 2972.4348 2973.5433 2973.7181 2977.1926 2982.2254 2982.5550 2993.5585 3003.4336 3007.1417 3016.5799 3021.6105 3025.5156 3027.7419 3033.3721 3042.5984 3055.6539 3068.4906 3069.7328 3070.4954 3072.6112 3073.4214 3079.6968 3088.5590 3094.9342 3122.0369
redmass: 3.9595 2.8612 3.9273 1.9760 2.3359 1.6129 3.9381 3.2229 3.9131 3.7557 2.3103 2.9952 4.3619 3.7890 1.8634 2.3769 2.2630 1.8375 1.1295 1.1007 1.9306 3.3359 2.0699 2.9693 2.9294 2.5813 2.3600 4.1570 6.7599 3.3167 3.4118 3.2730 4.3741 2.9390 3.1304 5.3771 3.8908 1.1211 1.0938 1.2679 1.8223 2.6002 1.2539 1.3528 3.0239 2.1062 2.1131 1.6828 1.7700 1.8520 1.7090 1.7468 2.6726 2.3451 3.0926 3.2501 2.2300 2.3433 2.5977 2.1771 1.9191 2.2515 1.9542 2.2649 2.3518 2.0617 1.9569 2.0844 2.6051 1.3813 1.3565 1.3547 1.2940 1.3039 1.2152 1.1196 1.1324 1.1089 1.1622 1.4409 1.1813 1.4292 1.4642 1.4550 1.2982 1.4992 1.4594 1.2271 1.2197 1.2177 1.2072 1.0961 1.0714 1.0446 1.0744 1.0684 1.0690 1.0668 1.0629 1.0430 1.0454 1.0637 1.0521 1.0665 1.0770 1.0641 1.0699 8.7149 12.5757 1.0592 1.0583 1.0615 1.0595 1.0389 1.0374 1.0592 1.0627 1.0424 1.0578 1.0359 1.0966 1.0959 1.0974 1.0974 1.0818 1.0980 1.0601 1.1023 1.1014 1.1008 1.1000 1.0979 1.0992 1.1002 1.1006 1.0975 1.1026 1.1067
irintensity: 0.4497 0.1675 0.9076 0.3250 0.2623 0.1011 0.7522 0.2095 1.1711 0.2254 0.1262 0.4172 1.4765 3.1128 0.4533 0.8455 2.2697 0.9419 0.0090 0.0175 0.3498 0.0563 0.2148 7.0575 5.5662 0.1999 0.2986 3.8269 3.5631 1.0124 1.5715 1.7927 1.4284 2.3628 0.8317 3.6255 13.8775 6.7795 10.6167 5.6720 6.0124 0.5284 1.0074 4.5273 2.9936 4.9861 3.2981 8.8743 2.4493 4.2607 8.3206 5.3504 5.1944 17.5629 45.9462 22.4176 9.4754 0.4450 27.5110 4.1807 123.9481 10.3226 33.6937 124.4273 1.6208 9.9734 21.5547 21.1075 15.6132 5.5726 0.2467 27.7997 1.2517 4.8275 0.0742 3.9908 0.7795 1.4367 5.9493 51.3393 4.1931 8.0745 3.0827 2.2485 1.2724 0.9412 1.2230 29.9909 6.7467 12.0476 19.7320 14.0033 1.3278 14.8932 2.8437 0.6989 0.7193 1.3888 8.1417 10.5664 11.2269 6.7695 15.4113 15.2388 22.9963 4.3319 18.0846 140.0328 10.0935 24.5333 7.2129 0.8076 10.3927 30.6752 30.3678 41.0100 26.9607 69.2515 48.3978 15.6353 4.0760 18.0897 4.9659 2.9948 1.9292 31.8178 25.7402 50.8645 22.1521 101.3010 56.0674 32.5882 52.8055 71.4127 59.7475 35.6577 2.2570 27.2657
temp: 298.150 k
press: 1.00000 atm
elementType: 8 8 7 6 6 6 6 6 6 6 6 6 6 6 6 6 6 6 6 1 1 1 1 1 1 1 1 1 1 1 1 1 1 1 1 1 1 1 1 1 1 1 1 1 1 1 1 1
symmnumber: 1
zpe: 1103337.4 jmol-1
zpe.correction: 0.420239 hartree
zpe.thermalcorrener: 0.444609 hartree
zpe.thermalcorrenthalpy: 0.445553 hartree
zpe.thermalcorrgfe: 0.364080 hartree
zpe.sumelectzpe: -830.746530 hartree
zpe.sumelectthermal: -830.722160 hartree
zpe.sumelectthermalent: -830.721216 hartree
zpe.sumelectthermalfe: -830.802689 hartree
dipole: -1.2919 -3.7503 -3.6277
dipole: 5.3753
quadrupole: -103.6843 -123.1610 -130.6649
quadrupole: 5.1480 1.9585 -5.6381
quadrupole: 15.4857 -3.9909 -11.4948 5.1480 1.9585 -5.6381
hfenergy: -831.1667692 hartree
pointgroup: C01 [X(C16H29N1O2)]
dipole: -0.7223912 1.569783 1.2191854 debye
polarizability: 203.5578857|-3.3640833|185.1864584|-7.1854928|4.0857468|160.4940365 unknown
InChI: InChI=1S/C16H29NO2/c1-5-9-11-16(7-3,12-10-6-2)14(13-17)15(18)19-8-4/h14H,5-12H2,1-4H3
charge 0 multiplicity 1
48 atoms
O  -3.125798 0.544066 -0.527806
O  -2.258929 -1.545938 0.047423
N  0.135706 -1.505356 -2.903516
C  0.246507 0.617989 0.051897
C  0.572663 -0.520927 1.072645
C  1.519305 1.0869 -0.725111
C  -0.386819 1.793204 0.87443
C  -0.817303 0.163232 -1.053818
C  1.202375 -1.83202 0.549725
C  2.6414 1.723601 0.126046
C  -0.745415 3.085612 0.109794
C  1.576155 -2.783975 1.710808
C  3.875655 2.093625 -0.730595
C  -2.110237 -0.408948 -0.448274
C  -0.281884 -0.782501 -2.051546
C  2.190561 -4.111386 1.217384
C  5.000353 2.756983 0.092513
C  -4.455578 0.154213 0.048695
C  -4.502183 0.433219 1.552951
H  1.254935 -0.08319 1.830193
H  -0.355197 -0.781173 1.619952
H  1.217363 1.815773 -1.505807
H  1.941728 0.220921 -1.26987
H  0.328126 2.042283 1.682274
H  -1.295321 1.417538 1.386388
H  -1.10171 1.074948 -1.611922
H  0.493871 -2.353939 -0.119451
H  2.112506 -1.6228 -0.047831
H  2.959508 1.027519 0.927611
H  2.272156 2.639025 0.63082
H  0.126814 3.508903 -0.42011
H  -1.104686 3.854095 0.81882
H  -1.555006 2.92445 -0.624306
H  0.667854 -2.996551 2.31067
H  2.289402 -2.273548 2.391284
H  3.561709 2.775855 -1.547055
H  4.263971 1.179447 -1.223457
H  1.483539 -4.652399 0.561303
H  2.44887 -4.777749 2.061083
H  3.113308 -3.929186 0.634463
H  5.352861 2.085292 0.898078
H  5.870441 3.008299 -0.541233
H  4.646924 3.692047 0.567121
H  -4.626658 -0.91432 -0.169771
H  -5.167644 0.778434 -0.513544
H  -3.79304 -0.213392 2.096381
H  -4.266784 1.490047 1.767436
H  -5.518276 0.22308 1.935035
