program: Gaussian 09
title: 000256493
version: EM64L-G09RevD.01
frameworkgroup: C1[X(C15H27NO2)]
method: RPBEPBE
basis: SDD
operation: Freq
keyword: #p
keyword: freq=noraman
keyword: PBEPBE/SDD
title: #p freq=noraman PBEPBE/SDD
converged: NO YES NO NO
title: Mulliken charges:
elementType: O O N C C C C C C C C C C C C C C C H H H H H H H H H H H H H H H H H H H H H H H H H H H
charge: -0.270133 -0.211003 -0.002631 0.360091 -0.462504 -0.457203 -0.230546 -0.804325 -0.387268 -0.391988 -0.354890 -0.353794 0.208384 -0.223294 -0.700903 -0.700519 -0.261928 -0.664025 0.238527 0.224736 0.204458 0.209957 0.285747 0.216237 0.244799 0.226599 0.204937 0.196693 0.217585 0.206323 0.199407 0.201491 0.191138 0.196316 0.207743 0.209792 0.218712 0.210902 0.211746 0.217949 0.228426 0.240874 0.226853 0.247001 0.223530
chargesum: 0.00000
title: Mulliken charges with hydrogens summed into heavy atoms:
elementType: O O N C C C C C C C C C C C C C C C
charge: -0.270133 -0.211003 -0.002631 0.360091 0.000759 -0.042788 0.055201 -0.116690 0.014362 0.031920 0.046008 0.033661 0.208384 -0.223294 -0.064655 -0.059922 0.207372 0.033359
polarizability: 1.92627421e+02 -7.72371274e+00 1.68421057e+02 7.58091363e+00 -4.63164177e+00 1.56182649e+02
1716.lowfreq: -12.9021 -0.0011 -0.0006 -0.0002 3.5289 8.9808 17.8923 39.2522 46.0285
frequency: 16.1334 38.2292 45.9062 52.8502 58.5989 60.7283 71.6609 82.3019 96.1548 114.1069 126.9246 134.0865 153.0677 163.4383 178.1159 210.0554 229.8547 231.9468 234.5087 241.1838 253.9040 277.0181 300.7468 306.9049 319.5529 363.6639 377.3347 405.4093 429.9094 448.7892 471.0732 528.0563 587.4126 680.8715 698.7914 728.1126 732.7480 766.5301 780.5613 782.4434 802.8384 819.1219 866.3184 894.5880 896.5813 906.9210 916.9193 946.1325 952.1951 987.2549 1015.5446 1022.3277 1031.4157 1033.1360 1067.3799 1072.5165 1087.0422 1091.3829 1095.3826 1100.4125 1108.8399 1146.0113 1156.7539 1173.6848 1191.9263 1224.0291 1242.0178 1252.5916 1270.5155 1278.2575 1280.5791 1285.9714 1293.6061 1301.2539 1310.8273 1321.8182 1337.2874 1341.1095 1355.5708 1361.2235 1363.6314 1389.8941 1390.7701 1391.0486 1393.3976 1457.3414 1460.4334 1461.8044 1463.5547 1467.6595 1469.2774 1477.2290 1477.9974 1478.4803 1479.0765 1482.0104 1483.5886 1486.1362 1488.0437 1489.8615 1643.2490 2193.8661 2958.9118 2960.8961 2965.9115 2971.1000 2972.0750 2972.4745 2978.5867 2979.4340 2983.3990 2993.0671 3001.5386 3005.4422 3015.8919 3026.3355 3030.9991 3034.2359 3046.1679 3049.0985 3068.7775 3068.8730 3071.5570 3071.9731 3074.0899 3084.4670 3087.7273 3094.9502 3122.1870
redmass: 3.8660 2.0718 2.6472 2.6574 3.1689 4.0250 1.6435 4.5393 4.5258 2.8606 3.6689 3.4196 2.7564 2.5833 3.0706 1.8516 1.1484 1.2112 1.4573 1.9594 1.7962 2.4187 3.7517 2.5907 2.8818 3.2660 3.2196 5.3897 3.3214 2.8783 4.7290 3.2203 3.9067 6.2512 4.0696 1.0896 1.0936 4.1676 1.2356 1.2605 1.5020 2.5072 2.7848 1.8891 1.7892 1.4163 1.7275 1.9258 1.8654 2.9606 1.7875 2.8749 2.8043 2.7340 1.9346 2.4697 2.3312 2.1979 2.0242 2.4244 2.0510 2.3914 1.6685 2.2013 2.1479 1.3997 1.4451 1.3531 1.3336 1.1214 1.4452 1.1501 1.2611 1.2326 1.1527 1.2996 1.4189 1.4234 1.2922 1.4746 1.4665 1.2270 1.2172 1.2182 1.1955 1.0899 1.0754 1.0704 1.0510 1.0701 1.0609 1.0581 1.0535 1.0439 1.0628 1.0595 1.0525 1.0560 1.0838 1.0842 8.8014 12.5736 1.0602 1.0601 1.0570 1.0602 1.0376 1.0370 1.0580 1.0592 1.0378 1.0359 1.0981 1.0981 1.0984 1.1005 1.0816 1.0603 1.1033 1.1023 1.1008 1.1008 1.0993 1.0991 1.0991 1.0990 1.0976 1.1023 1.1068
irintensity: 0.6842 0.1173 0.2585 0.4528 1.0204 0.7706 0.0702 1.4178 0.6400 0.2754 0.7254 3.2458 0.1370 0.4133 1.2363 2.4004 0.1478 0.1425 0.3137 0.4215 0.5154 0.1151 2.6150 5.5880 4.3910 0.9609 1.7352 3.8183 0.0189 0.1406 3.5107 1.6767 2.6477 3.2259 13.7980 8.2933 10.0770 1.2716 0.3303 0.0705 3.8166 2.6227 1.4810 5.6205 6.1846 1.7659 2.9604 4.9167 1.0826 5.0777 1.7796 63.7922 12.6369 9.3712 9.9362 2.7705 143.0160 74.1440 23.0647 33.6775 14.0372 46.2267 15.0335 11.8184 1.2631 2.0020 2.7998 16.3139 12.0042 2.1741 9.0700 1.9463 31.1023 9.7161 7.6569 13.4539 4.2972 5.5486 1.7345 1.1585 2.7341 20.2227 10.9618 12.5451 22.9461 9.9947 1.1313 3.9828 12.2729 0.7327 3.0159 9.5382 2.7302 12.1403 6.4151 9.4748 14.2775 7.5459 16.2023 23.8771 138.2328 11.5542 3.1585 33.4611 3.3805 8.1812 41.3648 29.2163 50.4153 53.4194 31.1270 15.0149 11.8481 0.1233 3.4667 4.5195 2.6465 29.5976 48.2104 30.0870 53.2694 127.2607 57.7564 54.5794 30.0404 28.0088 36.4831 3.4815 26.4693
temp: 298.150 k
press: 1.00000 atm
elementType: 8 8 7 6 6 6 6 6 6 6 6 6 6 6 6 6 6 6 1 1 1 1 1 1 1 1 1 1 1 1 1 1 1 1 1 1 1 1 1 1 1 1 1 1 1
symmnumber: 1
zpe: 1029969.7 jmol-1
zpe.correction: 0.392295 hartree
zpe.thermalcorrener: 0.415236 hartree
zpe.thermalcorrenthalpy: 0.416180 hartree
zpe.thermalcorrgfe: 0.338315 hartree
zpe.sumelectzpe: -791.527280 hartree
zpe.sumelectthermal: -791.504340 hartree
zpe.sumelectthermalent: -791.503395 hartree
zpe.sumelectthermalfe: -791.581260 hartree
dipole: -3.1011 3.9789 -1.8244
dipole: 5.3645
quadrupole: -104.1604 -125.9203 -116.2642
quadrupole: 9.7220 2.2448 8.3609
quadrupole: 11.2879 -10.4720 -0.8159 9.7220 2.2448 8.3609
hfenergy: -791.9195752 hartree
pointgroup: C01 [X(C15H27N1O2)]
dipole: -1.2597093 -1.6285571 0.4640211 debye
polarizability: 193.2408996|8.3842943|169.1698154|-5.4014877|-2.4874888|154.8204118 unknown
InChI: InChI=1S/C15H27NO2/c1-5-8-10-15(4,11-9-6-2)13(12-16)14(17)18-7-3/h13H,5-11H2,1-4H3
charge 0 multiplicity 1
45 atoms
O  -2.353664 1.285805 0.268557
O  -0.467035 1.938704 1.477349
N  1.132222 3.192353 -1.795334
C  0.66971 -0.190949 -0.706662
C  1.851426 0.128042 0.265543
C  -0.200172 -1.358006 -0.138748
C  -0.248372 1.107369 -0.866956
C  1.208365 -0.539894 -2.120817
C  2.904551 -0.990486 0.444088
C  -1.424829 -1.802286 -0.972364
C  4.034888 -0.565028 1.412093
C  -2.186997 -2.968215 -0.29923
C  -0.984545 1.497571 0.429722
C  0.517407 2.264949 -1.365345
C  5.105269 -1.660994 1.600229
C  -3.405099 -3.445157 -1.118702
C  -3.22428 1.604467 1.448714
C  -3.305911 0.41126 2.403634
H  1.44103 0.39607 1.257977
H  2.371376 1.034995 -0.105014
H  -0.539104 -1.08806 0.883846
H  0.465432 -2.234641 -0.013694
H  -1.025938 0.878105 -1.618502
H  0.397254 -0.591227 -2.869561
H  1.937926 0.215665 -2.464256
H  1.714146 -1.521293 -2.109221
H  3.356634 -1.255025 -0.532576
H  2.43234 -1.913597 0.836445
H  -2.128608 -0.958287 -1.109451
H  -1.101713 -2.123276 -1.982627
H  3.593784 -0.30099 2.394612
H  4.511697 0.359584 1.028415
H  -2.520147 -2.647966 0.70999
H  -1.491287 -3.817549 -0.139838
H  4.659369 -2.585885 2.012935
H  5.581341 -1.919984 0.635539
H  5.902243 -1.332765 2.292346
H  -4.129083 -2.622338 -1.270688
H  -3.09467 -3.805277 -2.117693
H  -3.934996 -4.272723 -0.61229
H  -4.197459 1.838922 0.989591
H  -2.812061 2.497205 1.950503
H  -3.654564 -0.49416 1.876815
H  -2.324598 0.206603 2.863434
H  -4.02388 0.635692 3.213992
