program: Gaussian 09
title: 000264510
version: EM64L-G09RevD.01
frameworkgroup: C1[X(C8H8N2O4)]
method: RPBEPBE
basis: SDD
operation: Freq
keyword: #pfreq=noraman
keyword: PBEPBE/SDD
title: #p freq=noraman PBEPBE/SDD
converged: NO YES NO NO
title: Mulliken charges:
elementType: O O O O N N C C C C C C C C H H H H H H H H
charge: -0.300999 -0.216729 -0.199672 -0.236890 -0.403140 0.016517 0.342840 0.171446 -0.469111 0.429891 -0.276031 -0.407774 -0.526843 -0.066149 0.358100 0.253510 0.288128 0.344063 0.235495 0.235428 0.251223 0.176696
chargesum: 0.00000
title: Mulliken charges with hydrogens summed into heavy atoms:
elementType: O O O O N N C C C C C C C C
charge: -0.300999 -0.216729 -0.199672 -0.236890 -0.059077 0.016517 0.342840 0.171446 -0.111011 0.429891 -0.022521 -0.119646 0.195303 0.110547
polarizability: 1.76258349e+02 1.45148439e+00 1.53242764e+02 -1.80660689e-03 8.86638284e-03 4.99007172e+01
1716.lowfreq: -8.1352 -4.0956 0.0008 0.0009 0.0010 1.6129 48.7100 71.5879 80.5012
frequency: 48.6901 71.5855 80.4987 126.2071 139.6446 167.4957 174.8601 216.5361 239.0045 300.8839 304.5003 348.1550 374.8160 451.2965 469.3338 507.4037 555.9997 564.3602 615.6520 698.3191 718.6122 723.4487 741.5517 754.6157 818.3685 828.5391 913.5100 949.7738 960.2068 968.7634 986.6074 1063.4853 1111.3907 1116.5554 1134.5626 1154.2346 1202.5385 1213.7267 1255.6860 1270.9113 1367.1759 1374.0935 1406.4174 1429.5358 1445.6479 1467.4841 1468.6946 1480.8528 1516.3316 1602.3954 1608.2488 1638.9114 2945.2177 2979.5887 3075.8347 3138.8711 3167.6607 3192.1773 3197.2397 3499.0804
redmass: 13.8508 4.2362 5.2416 10.1151 4.8427 3.0174 4.0374 1.1719 9.7679 5.7035 4.1010 8.2612 3.6275 6.5690 3.3670 7.5408 5.0983 5.1676 7.1346 3.9723 5.4686 1.2930 10.6147 3.6905 1.5295 6.9871 5.6395 1.5935 1.3479 1.3916 8.8884 1.9562 4.3367 1.2555 1.4076 1.4559 2.1575 8.1787 1.5327 2.7158 5.1885 1.5330 3.4217 2.0500 1.9767 1.3225 1.0497 1.5935 2.8327 6.0045 8.0426 5.2551 1.0870 1.0319 1.1051 1.1012 1.0890 1.0956 1.0934 1.0769
irintensity: 0.5259 0.2657 1.8920 1.8217 15.4508 11.0315 3.3057 2.8075 9.0863 1.3402 6.0103 0.4343 4.2701 18.3717 2.8364 5.0191 2.3377 0.0096 22.1107 5.4101 7.6885 110.3096 11.7973 3.7341 42.2522 16.6328 3.6172 3.6841 0.1447 37.9946 64.5212 69.2318 10.6483 0.0908 77.8071 4.4916 88.3369 373.3934 23.2252 143.7654 74.3444 15.0135 54.1183 66.1456 84.7663 106.7513 17.0470 26.3780 347.6832 88.7940 109.0811 124.5363 115.1653 56.0249 33.4652 15.1488 6.6735 3.3617 20.9344 49.7481
temp: 298.150 k
press: 1.00000 atm
elementType: 8 8 8 8 7 7 6 6 6 6 6 6 6 6 1 1 1 1 1 1 1 1
symmnumber: 1
zpe: 414768.0 jmol-1
zpe.correction: 0.157977 hartree
zpe.thermalcorrener: 0.170706 hartree
zpe.thermalcorrenthalpy: 0.171651 hartree
zpe.thermalcorrgfe: 0.118091 hartree
zpe.sumelectzpe: -718.940157 hartree
zpe.sumelectthermal: -718.927427 hartree
zpe.sumelectthermalent: -718.926483 hartree
zpe.sumelectthermalfe: -718.980043 hartree
dipole: -9.4484 -4.6329 0.0040
dipole: 10.5232
quadrupole: -83.3365 -80.8494 -81.3515
quadrupole: 2.0051 -0.0139 0.0025
quadrupole: -1.4907 0.9964 0.4943 2.0051 -0.0139 0.0025
hfenergy: -719.0981335 hartree
pointgroup: C01 [X(C8H8N2O4)]
dipole: 3.6183214 1.9462787 -0.5103326 debye
dipolederiv: -1.6853937 -0.6541554 0.1828208 -0.4031731 -0.5617728 0.0648226 0.1461185 0.0804467 -0.3116337 -0.895284 0.2139439 0.0089869 0.2942804 -0.5756403 0.0321794 -0.0028693 0.0371445 -0.2415886 -0.6839324 -0.170302 0.0537846 -0.279661 -0.6971961 0.0876798 0.0700954 0.0809731 -0.2392334 -0.5014767 -0.6441807 0.1050205 0.0356436 -0.9281833 0.0841994 0.0042242 0.1257117 -0.36439 -0.4820614 0.2652683 -0.0293114 0.4459525 -1.623832 0.1660487 -0.0561377 0.1774753 -0.341444 2.0017535 0.0641302 -0.121945 0.1324581 1.0384744 -0.1349856 -0.1322679 -0.1308293 0.2115821 0.1089308 -0.7814745 0.114606 -0.8336511 0.564146 -0.0195111 0.1222944 -0.0230099 0.0828068 1.4948113 0.5085791 -0.1635057 0.215406 -0.0443016 0.0028474 -0.1201909 -0.0152047 0.0754641 0.1691746 0.2561134 -0.0562687 -0.20726 -0.1291925 0.0133432 0.0125411 -0.0151354 -0.1237713 -0.8047508 -0.19214 0.0809173 -0.1298977 -0.0291311 0.0187041 0.071674 0.0226469 0.0351106 -0.4479622 -0.0987574 0.0319812 0.2598135 0.1004261 -0.0557014 -0.0210974 -0.0334998 -0.1621329 0.2066729 0.1430788 -0.0413967 0.2605812 -0.0343644 -0.0287747 -0.0587293 -0.0215669 -0.1123597 0.5261141 0.2433872 -0.0490387 0.5568312 0.624649 -0.080409 -0.0954971 -0.060982 0.3265138 0.709881 0.5967064 -0.1225585 -0.166951 1.8906045 -0.2474265 -0.0093294 -0.2943337 0.196374 0.1664311 -0.0316974 0.0064811 -0.0158414 0.1585824 0.0064005 0.0041736 0.0073131 0.1935522 0.0571932 -0.0700827 0.0169604 -0.0732771 -0.0366169 0.034217 0.0173357 0.0339347 0.1579477 0.0935414 0.0549523 -0.0031477 0.0285085 0.0808561 0.0122624 0.0007681 0.0106205 0.1735041 0.1902277 0.0312854 0.0037996 -0.0017005 0.2301993 0.0146561 0.0085828 0.0127008 0.3254915 0.078825 0.0575506 0.0705673 -0.1122235 -0.077934 -0.0621919 0.030363 -0.0990438 -0.049142 0.0653773 0.0442492 -0.1029356 -0.1098811 -0.0298811 0.072323 -0.0151192 0.088928 -0.0835506 -0.1279252 -0.0245019 0.0197292 0.0361181 0.0800234 0.0050057 0.0107543 0.0088016 0.1279778 -0.2401476 0.1880472 -0.0055468 0.0679243 0.000085 0.0143109 0.0123131 0.0069087 0.1229215 unknown
polarizability: 175.5969652|1.3967437|151.1695605|-7.9586238|-15.1171916|52.6353043 unknown
InChI: InChI=1S/C8H8N2O4/c1-14-8-3-2-6(10(12)13)4-7(8)9-5-11/h2-5,9H,1H3
charge 0 multiplicity 1
22 atoms
O  2.722522 0.870919 -0.352257
O  -3.650589 1.150049 0.000411
O  -3.287772 -1.080519 0.309087
O  0.511146 -3.492796 0.431671
N  1.821371 -1.563149 0.065332
N  -2.870518 0.122898 0.104607
C  0.842276 -0.546139 -0.025635
C  1.329317 0.78406 -0.253513
C  -0.545807 -0.76503 0.092881
C  -1.411266 0.346898 -0.018962
C  0.440593 1.87349 -0.360237
C  -0.946562 1.658252 -0.242631
C  3.32415 2.191098 -0.58344
C  1.623246 -2.923801 0.279395
H  -0.939992 -1.76788 0.266445
H  0.816474 2.885235 -0.533025
H  -1.664033 2.478256 -0.320262
H  2.786687 -1.2342 -0.042739
H  3.088357 2.880052 0.248441
H  2.976462 2.61781 -1.54225
H  4.407453 2.010248 -0.624732
H  2.591984 -3.472447 0.301312
